{"text_format":"1","workbook":"xlsx","n_sheets":3,"sheets":["LA 4","LA 4 SUB+ LA 4","LA 4 SUB"],"not_rendered":{"charts":0,"images":4,"macros":1,"external_links":0,"defined_names":2,"comments":3,"pivot_tables":0},"unopened":[],"bounds":{"document_bytes":16777216,"sheet_cells":100000,"rows_first":2000,"rows_last":500,"rows_between":2000,"halvings":0,"cell_chars":16384,"cell_head_chars":4096},"cells_cut":0,"cells_raw":0,"read":"whole","date_system":"1900"}

{"sheet":"LA 4","index":0,"n_rows":101,"n_cols":64,"rows_kept":101,"cut":false,"hidden":false,"merged":[[77,57,77,58],[29,1,30,1],[26,1,27,1],[75,45,75,47],[77,45,77,46],[32,39,32,40]]}
[null,null,null,null,null,null,null,null,null,null,null,null,null,null,null,null,null,null,null,null,null,null,null,null,null,null,null,null,null,null,null,null,null,null,null,null,null,null,null,null,null,null,null,null,"Weight total:",{"$f":"+H7","v":48.65},"kg","Total weight includes: FR 4 ( 9 kg), Main LS Cables (30 kg)"]
[]
[null,null,null,null,null,null,null,null,null,null,null,null,null,null,null,null,null,null,null,null,null,null,null,null,null,null,null,null,null,null,null,null,null,null,null,null,null,null,null,null,null,null,null,null,"2 motors, kg","front motor",null,null,null,null,null,null,null,null,null,null,null,"rear motor"]
[null,null,null,null,null,null,null,null,null,null,null,null,null,null,null,null,null,null,null,null,null,null,null,null,null,null,null,null,null,null,null,null,null,null,null,null,null,null,null,null,null,null,null,null,null,{"$f":"+((D7-D8)/D7)*H7","v":40.012597916666664},null,null,null,null,null,null,null,null,null,null,null,{"$f":"+(D8/D7)*H7","v":8.6374020833333329}]
[null,null,null,null,null,null,null,null,null,null,null,null,null,null,null,null,null,null,null,null,null,null,null,null,null,null,null,null,null,null,null,null,null,null,null,null,null,null,null,null,null,null,null,null,null,null,null,null,null,null,null,null,null,null,null,{"$f":"IF(BE21=12,11)","v":false},null,{"$f":"IF(BE21=12,13)","v":false}]
[null,null,null,null,null,null,null,null,null,null,null,null,null,null,null,null,null,null,null,null,null,null,null,null,null,null,null,null,null,null,null,null,null,null,null,null,null,null,null,null,null,null,null,null,null,null,null,null,null,null,null,null,null,{"$f":"IF(BD21=11,9)","v":false},null,null,null,{"$f":"IF(BD21=11,13)","v":false}]
[null,"L(2motors)=",null,480,null,"kg","G",{"$f":"+(B32*9.65)+9+30","v":48.65},null,{"$f":"AND(D24>=5,E24>=5)","v":true},{"$f":"IF(D24>=5,\"O K \",\"OVERLOAD\")","v":"O K "},{"$f":"IF(E24>=5,\"O K \",\"OVERLOAD\")","v":"O K "},null,null,null,null,null,null,null,null,null,null,null,null,null,null,null,null,null,null,null,null,null,null,null,null,null,null,null,null,null,null,null,null,null,null,null,null,null,null,null,{"$f":"IF(BC21=10,7)","v":false},null,null,null,null,null,{"$f":"IF(BC21=10,13)","v":false}]
[null,"a(2motors)=a-15",null,{"$f":"+H11-15","v":85.22},null,"mm","L",153,null,null,null,null,null,null,null,null,null,null,null,null,null,null,null,null,null,null,null,null,null,null,null,null,null,null,null,null,null,null,null,null,null,null,null,null,null,null,null,null,null,{"$f":"IF(BB21=9,5)","v":false},null,null,null,null,null,null,null,{"$f":"IF(BB21=9,13)","v":false}]
[null,null,null,null,null,null,null,null,null,"destroying force, kg",1700,1700,null,null,null,null,null,null,null,null,null,null,null,null,null,null,null,null,null,null,null,null,null,null,null,null,null,null,null,null,null,null,null,null,null,null,null,{"$f":"IF(BA21=8,3)","v":false},null,null,null,null,null,null,null,null,null,{"$f":"IF(BA21=8,13)","v":false}]
[null,null,null,null,null,{"$f":"+B32","v":1},null,{"$f":"IF(F10<=40,F10)","v":1},null,null,"Fa=((L-a)/L)*G","Fb=(a/L)*G",null,null,null,null,null,null,null,null,null,null,null,null,null,null,null,null,null,null,null,null,null,null,null,null,null,null,null,null,null,null,null,null,null,{"$f":"IF(AZ21=7,1)","v":false},null,null,null,null,null,null,null,null,null,null,null,{"$f":"IF(AZ21=7,13)","v":false}]
[null,null,null,null,null,"mm","a",{"$f":"SUM(V35:V74)/H10","v":100.22},null,"kg",{"$f":"+((H8-H11)/H8)*H7","v":16.782660130718952},{"$f":"+(H11/H8)*H7","v":31.867339869281043},null,null,null,null,null,null,null,null,null,null,null,null,null,null,null,null,null,null,null,null,null,null,null,null,null,null,null,null,null,null,null,null,null,{"$f":"IF(AZ21=61,1)","v":false},null,null,null,null,null,null,null,null,null,null,null,{"$f":"IF(AZ21=61,10)","v":false}]
[null,null,null,null,null,null,null,null,null,null,null,null,null,null,null,null,null,null,null,null,null,null,null,null,null,null,null,null,null,null,null,null,null,null,null,null,null,null,null,null,null,null,null,null,null,{"$f":"IF(AY21=6,1)","v":false},null,null,null,null,null,null,null,null,null,{"$f":"IF(AY21=6,8)","v":false}]
[null,null,null,null,null,null,null,null,null,null,null,null,null,null,null,null,null,null,null,null,null,null,null,null,null,null,null,null,null,null,null,null,null,null,null,null,null,null,null,null,null,null,null,null,null,{"$f":"IF(AX21=5,1)","v":false},null,null,null,null,null,null,null,{"$f":"IF(AX21=5,9)","v":false}]
[null,null,null,null,null,null,null,null,null,null,null,null,null,null,null,null,null,null,null,null,null,null,null,null,null,null,null,null,null,null,null,null,null,null,null,null,null,null,null,null,null,null,null,null,null,{"$f":"IF(AW21=4,1)","v":false},null,null,null,null,null,{"$f":"IF(AW21=4,7)","v":false}]
[null,null,null,null,null,null,null,null,null,null,null,null,null,null,null,null,null,null,null,null,null,null,null,null,null,null,null,null,null,null,null,null,null,null,null,null,null,null,null,null,null,null,null,null,null,{"$f":"IF(AV21=3,1)","v":1},null,null,null,{"$f":"IF(AV21=3,5)","v":5}]
[null,null,null,null,null,null,null,null,null,null,null,null,null,null,null,null,null,null,null,null,null,null,null,null,null,null,null,null,null,null,null,null,null,null,null,null,null,null,null,null,null,null,null,null,null,{"$f":"IF(AU21=2,1)","v":false},null,{"$f":"IF(AU21=2,3)","v":false}]
[]
[]
[null,null,null,null,null,null,null,null,null,null,null,null,null,null,null,null,null,null,null,null,null,null,null,null,null,null,null,null,null,null,null,null,null,null,null,null,null,null,null,null,null,null,null,null,"2 points-one motor",{"$f":"SUM(AT5:AT17)","v":1},0,0,0,5,0,{"$f":"SUM(AZ5:AZ17)","v":0},0,0,0,{"$f":"SUM(BD5:BD17)","v":0},0,0]
[]
[null,null,null,{"$f":"+K9/K11","v":101.29502634021188},{"$f":"+L9/L11","v":53.346153364960912},null,null,null,null,null,null,null,null,null,null,null,null,null,null,null,null,null,null,null,null,null,null,null,null,null,null,null,null,null,null,null,null,null,null,null,null,null,null,null,null,{"$f":"+AK89","v":false},{"$f":"+AK90","v":false},{"$f":"+AK91","v":3},{"$f":"+AK92","v":false},{"$f":"+AK93","v":false},{"$f":"+AK94","v":false},{"$f":"+AK95","v":false},{"$f":"+AK96","v":false},{"$f":"+AK97","v":false},{"$f":"+AK98","v":false},{"$f":"+AK99","v":false},{"$f":"+AK100","v":false},{"$f":"+AK101","v":false}]
[null,null,null,null,null,null,null,null,null,null,null,null,null,null,null,null,null,null,null,null,null,null,null,null,null,null,null,null,null,null,null,null,null,null,null,null,null,null,null,null,null,null,null,null,"1 point-one motor",{"$f":"+AT21","v":false},{"$f":"+AU21","v":false},3,false,false,false,false,false,false,false,false,false,false]
[null,null,null,"front","rear",null,null,null,null,null,null,null,null,null,null,null,null,null,null,null,null,null,null,null,null,null,null,null,null,null,null,null,null,null,null,null,null,null,null,null,null,null,null,null,null,1,2,3,4,5,6,7,8,9,10,11,12,13]
[null,"k - safety factor\nof FR 4",null,{"$f":"ABS(D21)","v":101.29502634021188},{"$f":"ABS(E21)","v":53.346153364960912}]
[null,null,null,null,null,null,null,null,null,null,null,null,null,null,null,null,null,null,null,null,null,null,null,null,null,null,null,null,null,null,null,null,null,null,null,null,null,null,null,null,null,null,"center  om mass",null,null,null,null,null,null,null,null,null,null,null,null,null,null,null,null,null,null,"center  om mass"]
[null,{"$f":"IF(J7=TRUE,\"O K\",\"OVERLOAD\")","v":"O K"},null,null,null,null,null,null,null,null,null,null,null,null,null,null,null,null,null,null,null,null,null,null,null,null,null,null,null,null,null,null,null,null,null,null,null,null,null,null,null,null,null,{"$f":"-+AH89","v":85.22},null,null,null,null,null,null,null,null,null,null,null,null,null,null,null,null,null,null,{"$f":"+-AH101","v":-394.78},"mm"]
[null,"enter the angle of frame FR 4"]
[null,null,null,{"$f":"IF(AR26>0,\" \",\"change the angle of frame or of cabinets\")","v":" "}]
[null,0,null,{"$f":"IF(BK26<0,\" \",\"change the angle of frame or of cabinets\")","v":" "}]
[null,"enter the number of cabinets from 1 up to 40"]
[]
[null,1,null,"LA 4"]
[null,null,null,null,null,null,null,"d","k ","b","b/2","sin b/2","c=sin(b/2)*d","2c","e=a/2","sin(e)","f=sin(e)*2c","g center of  mass -x","h=g+f","center of mass X",null,null,null,null,null,null,null,null,null,null,null,null,null,null,null,null,null,"синьо","синьо","k - safety factor"]
[null,null,null,"enter the value of a-angle",null,null,null,null,null,null,null,null,null,null,null,null,null,null,null,null,null,null,null,"z- център на тежест на боксовете след него спрямо първата колона","a - общ ъгъл","t= 54.51-a","sin t","m= sin t *n(const)","r= 52.1+a","sin r","p= sin r *q(const)","g - тегло на боксожете под тази ","L=m+n","J=x-p","A=z-J","Fa=((L-A)/L)*G","Fb=(A/L)*G","front","rear","front","rear"]
[null,1,{"$f":"+($B$29*-1)+D35","v":0},0,"from 0 to 10",null,{"$f":"+D35","v":0},127,75.786360920000007,{"$f":"+I35-C35","v":75.786360920000007},{"$f":"+J35/2","v":37.893180460000004},{"$f":"SIN(K35*3.14159265358979/180)","v":0.61419127625645442},{"$f":"+L35*H35","v":78.002292084569717},{"$f":"+M35*2","v":156.00458416913943},{"$f":"+C35/2","v":0},{"$f":"SIN(O35*3.14159265358979/180)","v":0},{"$f":"+P35*N35","v":0},100.22,{"$f":"+R35+Q35","v":100.22},{"$f":"+S35","v":100.22},null,{"$f":"IF(B35<($B$32+1),T35,0)","v":100.22},null,{"$f":"SUM(V35:V74)/($B$32)","v":100.22},{"$f":"+C35","v":0},{"$f":"54.51975024-Y35","v":54.51975024},{"$f":"SIN(Z35*3.14159265358979/180)","v":0.81431564219351371},{"$f":"+AA35*64.8125","v":52.777832559667111},{"$f":"52.10681954+Y35","v":52.106819539999996},{"$f":"SIN(AC35*3.14159265358979/180)","v":0.78915719357455416},{"$f":"+AD35*126.9963","v":100.22004370235216},{"$f":"9.65*B32","v":9.65},{"$f":"+AE35+AB35","v":152.99787626201928},{"$f":"+V35-AE35","v":-4.3702352158447866E-5},{"$f":"+X35-AH35","v":100.22004370235216},{"$f":"+((AG35-AI35)/AG35)*AF35","v":3.3288441424413397},{"$f":"+(AI35/AG35)*AF35","v":6.3211558575586606},{"$f":"2*$K$9/AJ35","v":1021.3755449380923},{"$f":"2*$L$9/AK35","v":537.87631196189784},{"$f":"ABS(AL35)","v":1021.3755449380923},{"$f":"ABS(AM35)","v":537.87631196189784}]
[null,2,null,0,"from 0 to 20",null,{"$f":"+D36+AP36","v":0},127,75.786360920000007,{"$f":"+I36-D36","v":75.786360920000007},37.893180460000004,{"$f":"SIN(K36*3.14159265358979/180)","v":0.61419127625645442},78.002292084569717,156.00458416913943,{"$f":"+C35+(D36/2)","v":0},0,0,{"$f":"+T35","v":100.22},{"$f":"+R36+Q36","v":100.22},100.22,null,0,null,{"$f":"SUM(V36:V74)/($B$32-B35)","v":{"$error":"#DIV/0!"}},{"$f":"SUM(D36)+$C$35","v":0},{"$f":"54.51975024-Y36","v":54.51975024},0.81431564219351371,{"$f":"+AA36*64.8125","v":52.777832559667111},{"$f":"52.10681954+Y36","v":52.106819539999996},{"$f":"SIN(AC36*3.14159265358979/180)","v":0.78915719357455416},{"$f":"+AD36*126.9963","v":100.22004370235216},{"$f":"9.65*($B$32-B35)","v":0},{"$f":"+AE36+AB36","v":152.99787626201928},{"$f":"+V36-AE36","v":-100.22004370235216},{"$f":"+X36-AH36","v":{"$error":"#DIV/0!"}},{"$f":"+((AG36-AI36)/AG36)*AF36","v":{"$error":"#DIV/0!"}},{"$f":"+(AI36/AG36)*AF36","v":{"$error":"#DIV/0!"}},{"$error":"#DIV/0!"},{"$error":"#DIV/0!"},{"$f":"ABS(AL36)","v":{"$error":"#DIV/0!"}},{"$f":"ABS(AM36)","v":{"$error":"#DIV/0!"}}]
[null,3,null,0,"from 0 to 20",null,0,127,75.786360920000007,75.786360920000007,37.893180460000004,0.61419127625645442,78.002292084569717,156.00458416913943,{"$f":"+C35+D36+(D37/2)","v":0},0,0,100.22,{"$f":"+S36+Q37","v":100.22},100.22,null,0,null,{"$f":"SUM(V37:V74)/($B$32-B36)","v":0},{"$f":"SUM(D36:D37)+$C$35","v":0},54.51975024,0.81431564219351371,52.777832559667111,52.106819539999996,0.78915719357455416,100.22004370235216,{"$f":"9.65*($B$32-B36)","v":-9.65},152.99787626201928,{"$f":"+V37-AE37","v":-100.22004370235216},{"$f":"+X37-AH37","v":100.22004370235216},-3.3288441424413397,-6.3211558575586606,-1021.3755449380923,-537.87631196189784,1021.3755449380923,537.87631196189784]
[null,4,null,0,"from 0 to 20",null,0,127,75.786360920000007,75.786360920000007,37.893180460000004,0.61419127625645442,78.002292084569717,156.00458416913943,{"$f":"+C35+D36+D37+(D38/2)","v":0},0,0,100.22,100.22,100.22,null,0,null,{"$f":"SUM(V38:V74)/($B$32-B37)","v":0},{"$f":"SUM(D36:D38)+$C$35","v":0},54.51975024,0.81431564219351371,52.777832559667111,52.106819539999996,0.78915719357455416,100.22004370235216,-19.3,152.99787626201928,{"$f":"+V38-AE38","v":-100.22004370235216},{"$f":"+X38-AH38","v":100.22004370235216},-6.6576882848826795,-12.642311715117321,-510.68777246904614,-268.93815598094892,510.68777246904614,268.93815598094892]
[null,5,null,0,"from 0 to 20",null,0,127,75.786360920000007,75.786360920000007,37.893180460000004,0.61419127625645442,78.002292084569717,156.00458416913943,{"$f":"+C35+D36+D37+D38+(D39/2)","v":0},0,0,100.22,100.22,100.22,null,0,null,{"$f":"SUM(V39:V74)/($B$32-B38)","v":0},{"$f":"SUM(D36:D39)+$C$35","v":0},54.51975024,0.81431564219351371,52.777832559667111,52.106819539999996,0.78915719357455416,100.22004370235216,-28.950000000000003,152.99787626201928,{"$f":"+V39-AE39","v":-100.22004370235216},100.22004370235216,-9.9865324273240201,-18.963467572675984,-340.45851497936405,-179.29210398729924,340.45851497936405,179.29210398729924]
[null,6,null,0,"from 0 to 20",null,0,127,75.786360920000007,75.786360920000007,37.893180460000004,0.61419127625645442,78.002292084569717,156.00458416913943,{"$f":"+C35+D36+D37+D38+D39+(D40/2)","v":0},0,0,100.22,100.22,100.22,null,0,null,{"$f":"SUM(V40:V74)/($B$32-B39)","v":0},{"$f":"SUM(D36:D40)+$C$35","v":0},54.51975024,0.81431564219351371,52.777832559667111,52.106819539999996,0.78915719357455416,100.22004370235216,-38.6,152.99787626201928,-100.22004370235216,100.22004370235216,-13.315376569765359,-25.284623430234642,-255.34388623452307,-134.46907799047446,255.34388623452307,134.46907799047446]
[null,7,null,0,"from 0 to 20",null,0,127,75.786360920000007,75.786360920000007,37.893180460000004,0.61419127625645442,78.002292084569717,156.00458416913943,{"$f":"+C35+D36+D37+D38+D39+D40+(D41/2)","v":0},0,0,100.22,100.22,100.22,null,0,null,{"$f":"SUM(V41:V74)/($B$32-B40)","v":0},{"$f":"SUM(D36:D41)+$C$35","v":0},54.51975024,0.81431564219351371,52.777832559667111,52.106819539999996,0.78915719357455416,100.22004370235216,-48.25,152.99787626201928,-100.22004370235216,100.22004370235216,-16.644220712206696,-31.605779287793304,-204.27510898761849,-107.57526239237957,204.27510898761849,107.57526239237957]
[null,8,null,0,"from 0 to 20",null,0,127,75.786360920000007,75.786360920000007,37.893180460000004,0.61419127625645442,78.002292084569717,156.00458416913943,{"$f":"+C35+D36+D37+D38+D39+D40+D41+(D42/2)","v":0},0,0,100.22,100.22,100.22,null,0,null,{"$f":"SUM(V42:V74)/($B$32-B41)","v":0},{"$f":"SUM(D36:D42)+$C$35","v":0},54.51975024,0.81431564219351371,52.777832559667111,52.106819539999996,0.78915719357455416,100.22004370235216,-57.900000000000006,152.99787626201928,-100.22004370235216,100.22004370235216,-19.97306485464804,-37.926935145351969,-170.22925748968203,-89.646051993649621,170.22925748968203,89.646051993649621]
[null,9,null,0,"from 0 to 20",null,0,127,75.786360920000007,75.786360920000007,37.893180460000004,0.61419127625645442,78.002292084569717,156.00458416913943,{"$f":"+C35+D36+D37+D38+D39+D40+D41+D42+(D43/2)","v":0},0,0,100.22,100.22,100.22,null,0,null,{"$f":"SUM(V43:V74)/($B$32-B42)","v":0},{"$f":"SUM(D36:D43)+$C$35","v":0},54.51975024,0.81431564219351371,52.777832559667111,52.106819539999996,0.78915719357455416,100.22004370235216,-67.55,152.99787626201928,-100.22004370235216,100.22004370235216,-23.301908997089374,-44.24809100291062,-145.91079213401321,-76.839473137413989,145.91079213401321,76.839473137413989]
[null,10,null,0,"from 0 to 20",null,0,127,75.786360920000007,75.786360920000007,37.893180460000004,0.61419127625645442,78.002292084569717,156.00458416913943,{"$f":"+C35+D36+D37+D38+D39+D40+D41+D42+D43+(D44/2)","v":0},0,0,100.22,100.22,100.22,null,0,null,{"$f":"SUM(V44:V74)/($B$32-B43)","v":0},{"$f":"SUM(D36:D44)+$C$35","v":0},54.51975024,0.81431564219351371,52.777832559667111,52.106819539999996,0.78915719357455416,100.22004370235216,-77.2,152.99787626201928,-100.22004370235216,100.22004370235216,-26.630753139530718,-50.569246860469285,-127.67194311726153,-67.23453899523723,127.67194311726153,67.23453899523723]
[null,11,null,0,"from 0 to 20",null,0,127,75.786360920000007,75.786360920000007,37.893180460000004,0.61419127625645442,78.002292084569717,156.00458416913943,{"$f":"+C35+D36+D37+D38+D39+D40+D41+D42+D43+D44+(D45/2)","v":0},0,0,100.22,100.22,100.22,null,0,null,{"$f":"SUM(V45:V74)/($B$32-B44)","v":0},{"$f":"SUM(D36:D45)+$C$35","v":0},54.51975024,0.81431564219351371,52.777832559667111,52.106819539999996,0.78915719357455416,100.22004370235216,-86.850000000000009,152.99787626201928,-100.22004370235216,100.22004370235216,-29.959597281972059,-56.89040271802795,-113.48617165978803,-59.76403466243309,113.48617165978803,59.76403466243309]
[null,12,null,0,"from 0 to 20",null,0,127,75.786360920000007,75.786360920000007,37.893180460000004,0.61419127625645442,78.002292084569717,156.00458416913943,{"$f":"+C35+D36+D37+D38+D39+D40+D41+D42+D43+D44+D45+(D46/2)","v":0},0,0,100.22,100.22,100.22,null,0,null,{"$f":"SUM(V46:V74)/($B$32-B45)","v":0},{"$f":"SUM(D36:D46)+$C$35","v":0},54.51975024,0.81431564219351371,52.777832559667111,52.106819539999996,0.78915719357455416,100.22004370235216,-96.5,152.99787626201928,-100.22004370235216,100.22004370235216,-33.288441424413392,-63.211558575586608,-102.13755449380925,-53.787631196189785,102.13755449380925,53.787631196189785]
[null,13,null,0,"from 0 to 20",null,0,127,75.786360920000007,75.786360920000007,37.893180460000004,0.61419127625645442,78.002292084569717,156.00458416913943,{"$f":"+C35+D36+D37+D38+D39+D40+D41+D42+D43+D44+D45+D46+(D47/2)","v":0},0,0,100.22,100.22,100.22,null,0,null,{"$f":"SUM(V47:V74)/($B$32-B46)","v":0},{"$f":"SUM(D36:D47)+$C$35","v":0},54.51975024,0.81431564219351371,52.777832559667111,52.106819539999996,0.78915719357455416,100.22004370235216,-106.15,152.99787626201928,-100.22004370235216,100.22004370235216,-36.617285566854733,-69.532714433145273,-92.852322267099311,-48.89784654199071,92.852322267099311,48.89784654199071]
[null,14,null,0,"from 0 to 20",null,0,127,75.786360920000007,75.786360920000007,37.893180460000004,0.61419127625645442,78.002292084569717,156.00458416913943,{"$f":"+C35+D36+D37+D38+D39+D40+D41+D42+D43+D44+D45+D46+D47+(D48/2)","v":0},0,0,100.22,100.22,100.22,null,0,null,{"$f":"SUM(V48:V74)/($B$32-B47)","v":0},{"$f":"SUM(D36:D48)+$C$35","v":0},54.51975024,0.81431564219351371,52.777832559667111,52.106819539999996,0.78915719357455416,100.22004370235216,-115.80000000000001,152.99787626201928,-100.22004370235216,100.22004370235216,-39.946129709296081,-75.853870290703938,-85.114628744841013,-44.823025996824811,85.114628744841013,44.823025996824811]
[null,15,null,0,"from 0 to 20",null,0,127,75.786360920000007,75.786360920000007,37.893180460000004,0.61419127625645442,78.002292084569717,156.00458416913943,{"$f":"+C35+D36+D37+D38+D39+D40+D41+D42+D43+D44+D45+D46+D47+D48+(D49/2)","v":0},0,0,100.22,100.22,100.22,null,0,null,{"$f":"SUM(V49:V74)/($B$32-B48)","v":0},{"$f":"SUM(D36:D49)+$C$35","v":0},54.51975024,0.81431564219351371,52.777832559667111,52.106819539999996,0.78915719357455416,100.22004370235216,-125.45,152.99787626201928,-100.22004370235216,100.22004370235216,-43.274973851737414,-82.175026148262589,-78.567349610622486,-41.375100920145989,78.567349610622486,41.375100920145989]
[null,16,null,0,"from 0 to 20",null,0,127,75.786360920000007,75.786360920000007,37.893180460000004,0.61419127625645442,78.002292084569717,156.00458416913943,{"$f":"+C35+D36+D37+D38+D39+D40+D41+D42+D43+D44+D45+D46+D47+D48+D49+(D50/2)","v":0},0,0,100.22,100.22,100.22,null,0,null,{"$f":"SUM(V50:V74)/($B$32-B49)","v":0},{"$f":"SUM(D36:D50)+$C$35","v":0},54.51975024,0.81431564219351371,52.777832559667111,52.106819539999996,0.78915719357455416,100.22004370235216,-135.1,152.99787626201928,-100.22004370235216,100.22004370235216,-46.603817994178748,-88.49618200582124,-72.955396067006603,-38.419736568706995,72.955396067006603,38.419736568706995]
[null,17,null,0,"from 0 to 20",null,0,127,75.786360920000007,75.786360920000007,37.893180460000004,0.61419127625645442,78.002292084569717,156.00458416913943,{"$f":"+C35+D36+D37+D38+D39+D40+D41+D42+D43+D44+D45+D46+D47+D48+D49+D50+(D51/2)","v":0},0,0,100.22,100.22,100.22,null,0,null,{"$f":"SUM(V51:V74)/($B$32-B50)","v":0},{"$f":"SUM(D36:D51)+$C$35","v":0},54.51975024,0.81431564219351371,52.777832559667111,52.106819539999996,0.78915719357455416,100.22004370235216,-144.75,152.99787626201928,-100.22004370235216,100.22004370235216,-49.932662136620088,-94.817337863379905,-68.091702995872836,-35.858420797459857,68.091702995872836,35.858420797459857]
[null,18,null,0,"from 0 to 20",null,0,127,75.786360920000007,75.786360920000007,37.893180460000004,0.61419127625645442,78.002292084569717,156.00458416913943,{"$f":"+C35+D36+D37+D38+D39+D40+D41+D42+D43+D44+D45+D46+D47+D48+D49+D50+D51+(D52/2)","v":0},0,0,100.22,100.22,100.22,null,0,null,{"$f":"SUM(V52:V74)/($B$32-B51)","v":0},{"$f":"SUM(D36:D52)+$C$35","v":0},54.51975024,0.81431564219351371,52.777832559667111,52.106819539999996,0.78915719357455416,100.22004370235216,-154.4,152.99787626201928,-100.22004370235216,100.22004370235216,-53.261506279061436,-101.13849372093857,-63.835971558630767,-33.617269497618615,63.835971558630767,33.617269497618615]
[null,19,null,0,"from 0 to 20",null,0,127,75.786360920000007,75.786360920000007,37.893180460000004,0.61419127625645442,78.002292084569717,156.00458416913943,{"$f":"+C35+D36+D37+D38+D39+D40+D41+D42+D43+D44+D45+D46+D47+D48+D49+D50+D51+D52+(D53/2)","v":0},0,0,100.22,100.22,100.22,null,0,null,{"$f":"SUM(V53:V74)/($B$32-B52)","v":0},{"$f":"SUM(D36:D53)+$C$35","v":0},54.51975024,0.81431564219351371,52.777832559667111,52.106819539999996,0.78915719357455416,100.22004370235216,-164.05,152.99787626201928,-100.22004370235216,100.22004370235216,-56.590350421502777,-107.45964957849723,-60.080914408123078,-31.639783056582225,60.080914408123078,31.639783056582225]
[null,20,null,0,"from 0 to 20",null,0,127,75.786360920000007,75.786360920000007,37.893180460000004,0.61419127625645442,78.002292084569717,156.00458416913943,{"$f":"+C35+D36+D37+D38+D39+D40+D41+D42+D43+D44+D45+D46+D47+D48+D49+D50+D51+D52+D53+(D54/2)","v":0},0,0,100.22,100.22,100.22,null,0,null,{"$f":"SUM(V54:V74)/($B$32-B53)","v":0},{"$f":"SUM(D36:D54)+$C$35","v":0},54.51975024,0.81431564219351371,52.777832559667111,52.106819539999996,0.78915719357455416,100.22004370235216,-173.70000000000002,152.99787626201928,-100.22004370235216,100.22004370235216,-59.919194563944117,-113.7808054360559,-56.743085829894014,-29.882017331216545,56.743085829894014,29.882017331216545]
[null,21,null,0,"from 0 to 20",null,0,127,75.786360920000007,75.786360920000007,37.893180460000004,0.61419127625645442,78.002292084569717,156.00458416913943,{"$f":"+C35+D36+D37+D38+D39+D40+D41+D42+D43+D44+D45+D46+D47+D48+D49+D50+D51+D52+D53+D54+(D55/2)","v":0},0,0,100.22,100.22,100.22,null,0,null,0,{"$f":"SUM(D36:D55)+$C$35","v":0},54.51975024,0.81431564219351371,52.777832559667111,52.106819539999996,0.78915719357455416,100.22004370235216,-183.35,152.99787626201928,-100.22004370235216,100.22004370235216,-63.248038706385451,-120.10196129361455,-53.756607628320651,-28.309279576941993,53.756607628320651,28.309279576941993]
[null,22,null,0,"from 0 to 20",null,0,127,75.786360920000007,75.786360920000007,37.893180460000004,0.61419127625645442,78.002292084569717,156.00458416913943,{"$f":"+C35+D36+D37+D38+D39+D40+D41+D42+D43+D44+D45+D46+D47+D48+D49+D50+D51+D52+D53+D54+D55+(D56/2)","v":0},0,0,100.22,100.22,100.22,null,0,null,0,{"$f":"SUM(D36:D56)+$C$35","v":0},54.51975024,0.81431564219351371,52.777832559667111,52.106819539999996,0.78915719357455416,100.22004370235216,-193,152.99787626201928,-100.22004370235216,100.22004370235216,-66.576882848826784,-126.42311715117322,-51.068777246904624,-26.893815598094893,51.068777246904624,26.893815598094893]
[null,23,null,0,"from 0 to 20",null,0,127,75.786360920000007,75.786360920000007,37.893180460000004,0.61419127625645442,78.002292084569717,156.00458416913943,{"$f":"+C35+D36+D37+D38+D39+D40+D41+D42+D43+D44+D45+D46+D47+D48+D49+D50+D51+D52+D53+D54+D55+D56+(D57/2)","v":0},0,0,100.22,100.22,100.22,null,0,null,0,{"$f":"SUM(D36:D57)+$C$35","v":0},54.51975024,0.81431564219351371,52.777832559667111,52.106819539999996,0.78915719357455416,100.22004370235216,-202.65,152.99787626201928,-100.22004370235216,100.22004370235216,-69.905726991268125,-132.74427300873188,-48.636930711337733,-25.613157712471324,48.636930711337733,25.613157712471324]
[null,24,null,0,"from 0 to 20",null,0,127,75.786360920000007,75.786360920000007,37.893180460000004,0.61419127625645442,78.002292084569717,156.00458416913943,{"$f":"+SUM(D36:D57)+(D58/2)+C35","v":0},0,0,100.22,100.22,100.22,null,0,null,0,{"$f":"SUM(D36:D58)+$C$35","v":0},54.51975024,0.81431564219351371,52.777832559667111,52.106819539999996,0.78915719357455416,100.22004370235216,-212.3,152.99787626201928,-100.22004370235216,100.22004370235216,-73.234571133709466,-139.06542886629055,-46.426161133549655,-24.448923270995355,46.426161133549655,24.448923270995355]
[null,25,null,0,"from 0 to 20",null,{"$f":"+D59+AP59","v":0},127,75.786360920000007,{"$f":"+I59-D59","v":75.786360920000007},{"$f":"+J59/2","v":37.893180460000004},{"$f":"SIN(K59*3.14159265358979/180)","v":0.61419127625645442},{"$f":"+L59*H59","v":78.002292084569717},{"$f":"+M59*2","v":156.00458416913943},{"$f":"+SUM(D37:D58)+(D59/2)+C36","v":0},{"$f":"SIN(O59*3.14159265358979/180)","v":0},{"$f":"+P59*N59","v":0},{"$f":"+T58","v":100.22},{"$f":"+S58+Q59","v":100.22},{"$f":"+S59","v":100.22},null,{"$f":"IF(B59<($B$32+1),T59,0)","v":0},null,0,{"$f":"SUM(D36:D59)+$C$35","v":0},{"$f":"54.51975024-Y59","v":54.51975024},{"$f":"SIN(Z59*3.14159265358979/180)","v":0.81431564219351371},{"$f":"+AA59*64.8125","v":52.777832559667111},{"$f":"52.10681954+Y59","v":52.106819539999996},{"$f":"SIN(AC59*3.14159265358979/180)","v":0.78915719357455416},{"$f":"+AD59*126.9963","v":100.22004370235216},{"$f":"9.65*($B$32-B58)","v":-221.95000000000002},{"$f":"+AE59+AB59","v":152.99787626201928},{"$f":"+V59-AE59","v":-100.22004370235216},{"$f":"+X59-AH59","v":100.22004370235216},{"$f":"+((AG59-AI59)/AG59)*AF59","v":-76.563415276150806},{"$f":"+(AI59/AG59)*AF59","v":-145.38658472384921},{"$f":"2*$K$9/AJ59","v":-44.407632388612711},{"$f":"2*$L$9/AK59","v":-23.385926607039035},{"$f":"ABS(AL59)","v":44.407632388612711},{"$f":"ABS(AM59)","v":23.385926607039035}]
[null,26,null,0,"from 0 to 20",null,0,127,75.786360920000007,75.786360920000007,37.893180460000004,0.61419127625645442,78.002292084569717,156.00458416913943,0,0,0,100.22,100.22,100.22,null,0,null,0,{"$f":"SUM(D36:D60)+$C$35","v":0},54.51975024,0.81431564219351371,52.777832559667111,52.106819539999996,0.78915719357455416,100.22004370235216,-231.60000000000002,152.99787626201928,-100.22004370235216,100.22004370235216,-79.892259418592161,-151.70774058140788,-42.557314372420507,-22.411512998412405,42.557314372420507,22.411512998412405]
[null,27,null,0,"from 0 to 20",null,0,127,75.786360920000007,75.786360920000007,37.893180460000004,0.61419127625645442,78.002292084569717,156.00458416913943,0,0,0,100.22,100.22,100.22,null,0,null,0,{"$f":"SUM(D36:D61)+$C$35","v":0},54.51975024,0.81431564219351371,52.777832559667111,52.106819539999996,0.78915719357455416,100.22004370235216,-241.25,152.99787626201928,-100.22004370235216,100.22004370235216,-83.221103561033487,-158.02889643896651,-40.855021797523698,-21.515052478475916,40.855021797523698,21.515052478475916]
[null,28,null,0,"from 0 to 20",null,0,127,75.786360920000007,75.786360920000007,37.893180460000004,0.61419127625645442,78.002292084569717,156.00458416913943,0,0,0,100.22,100.22,100.22,null,0,null,0,{"$f":"SUM(D36:D62)+$C$35","v":0},54.51975024,0.81431564219351371,52.777832559667111,52.106819539999996,0.78915719357455416,100.22004370235216,-250.9,152.99787626201928,-100.22004370235216,100.22004370235216,-86.549947703474828,-164.35005229652518,-39.283674805311243,-20.687550460072995,39.283674805311243,20.687550460072995]
[null,29,null,0,"from 0 to 20",null,0,127,75.786360920000007,75.786360920000007,37.893180460000004,0.61419127625645442,78.002292084569717,156.00458416913943,0,0,0,100.22,100.22,100.22,null,0,null,0,{"$f":"SUM(D36:D63)+$C$35","v":0},54.51975024,0.81431564219351371,52.777832559667111,52.106819539999996,0.78915719357455416,100.22004370235216,-260.55,152.99787626201928,-100.22004370235216,100.22004370235216,-89.878791845916169,-170.67120815408384,-37.828723886596016,-19.921344887477698,37.828723886596016,19.921344887477698]
[null,30,null,0,"from 0 to 20",null,0,127,75.786360920000007,75.786360920000007,37.893180460000004,0.61419127625645442,78.002292084569717,156.00458416913943,0,0,0,100.22,100.22,100.22,null,0,null,0,{"$f":"SUM(D36:D64)+$C$35","v":0},54.51975024,0.81431564219351371,52.777832559667111,52.106819539999996,0.78915719357455416,100.22004370235216,-270.2,152.99787626201928,-100.22004370235216,100.22004370235216,-93.207635988357495,-176.99236401164248,-36.477698033503302,-19.209868284353497,36.477698033503302,19.209868284353497]
[null,31,null,0,"from 0 to 20",null,0,127,75.786360920000007,75.786360920000007,37.893180460000004,0.61419127625645442,78.002292084569717,156.00458416913943,0,0,0,100.22,100.22,100.22,null,0,null,0,{"$f":"SUM(D36:D65)+$C$35","v":0},54.51975024,0.81431564219351371,52.777832559667111,52.106819539999996,0.78915719357455416,100.22004370235216,-279.85000000000002,152.99787626201928,-100.22004370235216,100.22004370235216,-96.53648013079885,-183.31351986920117,-35.2198463771756,-18.547459033168888,35.2198463771756,18.547459033168888]
[null,32,null,0,"from 0 to 20",null,0,127,75.786360920000007,75.786360920000007,37.893180460000004,0.61419127625645442,78.002292084569717,156.00458416913943,0,0,0,100.22,100.22,100.22,null,0,null,0,{"$f":"SUM(D36:D66)+$C$35","v":0},54.51975024,0.81431564219351371,52.777832559667111,52.106819539999996,0.78915719357455416,100.22004370235216,-289.5,152.99787626201928,-100.22004370235216,100.22004370235216,-99.865324273240176,-189.63467572675981,-34.045851497936418,-17.929210398729928,34.045851497936418,17.929210398729928]
[null,33,null,0,"from 0 to 20",null,0,127,75.786360920000007,75.786360920000007,37.893180460000004,0.61419127625645442,78.002292084569717,156.00458416913943,0,0,0,100.22,100.22,100.22,null,0,null,0,{"$f":"SUM(D36:D67)+$C$35","v":0},54.51975024,0.81431564219351371,52.777832559667111,52.106819539999996,0.78915719357455416,100.22004370235216,-299.15000000000003,152.99787626201928,-100.22004370235216,100.22004370235216,-103.19416841568153,-195.9558315843185,-32.947598223809429,-17.350848772964444,32.947598223809429,17.350848772964444]
[null,34,null,0,"from 0 to 20",null,0,127,75.786360920000007,75.786360920000007,37.893180460000004,0.61419127625645442,78.002292084569717,156.00458416913943,0,0,0,100.22,100.22,100.22,null,0,null,0,{"$f":"SUM(D36:D68)+$C$35","v":0},54.51975024,0.81431564219351371,52.777832559667111,52.106819539999996,0.78915719357455416,100.22004370235216,-308.8,152.99787626201928,-100.22004370235216,100.22004370235216,-106.52301255812287,-202.27698744187714,-31.917985779315384,-16.808634748809308,31.917985779315384,16.808634748809308]
[null,35,null,0,"from 0 to 20",null,0,127,75.786360920000007,75.786360920000007,37.893180460000004,0.61419127625645442,78.002292084569717,156.00458416913943,0,0,0,100.22,100.22,100.22,null,0,null,0,{"$f":"SUM(D36:D69)+$C$35","v":0},54.51975024,0.81431564219351371,52.777832559667111,52.106819539999996,0.78915719357455416,100.22004370235216,-318.45,152.99787626201928,-100.22004370235216,100.22004370235216,-109.8518567005642,-208.5981432994358,-30.950774089033104,-16.299282180663571,30.950774089033104,16.299282180663571]
[null,36,null,0,"from 0 to 20",null,0,127,75.786360920000007,75.786360920000007,37.893180460000004,0.61419127625645442,78.002292084569717,156.00458416913943,0,0,0,100.22,100.22,100.22,null,0,null,0,{"$f":"SUM(D36:D70)+$C$35","v":0},54.51975024,0.81431564219351371,52.777832559667111,52.106819539999996,0.78915719357455416,100.22004370235216,-328.1,152.99787626201928,-100.22004370235216,100.22004370235216,-113.18070084300555,-214.91929915699447,-30.040457204061539,-15.819891528291112,30.040457204061539,15.819891528291112]
[null,37,null,0,"from 0 to 20",null,0,127,75.786360920000007,75.786360920000007,37.893180460000004,0.61419127625645442,78.002292084569717,156.00458416913943,0,0,0,100.22,100.22,100.22,null,0,null,0,{"$f":"SUM(D36:D71)+$C$35","v":0},54.51975024,0.81431564219351371,52.777832559667111,52.106819539999996,0.78915719357455416,100.22004370235216,-337.75,152.99787626201928,-100.22004370235216,100.22004370235216,-116.50954498544688,-221.24045501455311,-29.182158426802641,-15.367894627482796,29.182158426802641,15.367894627482796]
[null,38,null,0,"from 0 to 20",null,0,127,75.786360920000007,75.786360920000007,37.893180460000004,0.61419127625645442,78.002292084569717,156.00458416913943,0,0,0,100.22,100.22,100.22,null,0,null,0,{"$f":"SUM(D36:D72)+$C$35","v":0},54.51975024,0.81431564219351371,52.777832559667111,52.106819539999996,0.78915719357455416,100.22004370235216,-347.40000000000003,152.99787626201928,-100.22004370235216,100.22004370235216,-119.83838912788823,-227.5616108721118,-28.371542914947007,-14.941008665608273,28.371542914947007,14.941008665608273]
[null,39,null,0,"from 0 to 20",null,0,127,75.786360920000007,75.786360920000007,37.893180460000004,0.61419127625645442,78.002292084569717,156.00458416913943,0,0,0,100.22,100.22,100.22,null,0,null,0,{"$f":"SUM(D36:D73)+$C$35","v":0},54.51975024,0.81431564219351371,52.777832559667111,52.106819539999996,0.78915719357455416,100.22004370235216,-357.05,152.99787626201928,-100.22004370235216,100.22004370235216,-123.16723327032956,-233.88276672967044,-27.604744457786282,-14.537197620591835,27.604744457786282,14.537197620591835]
[null,40,null,0,"from 0 to 20",null,0,127,75.786360920000007,75.786360920000007,37.893180460000004,0.61419127625645442,78.002292084569717,156.00458416913943,0,0,0,100.22,100.22,100.22,null,0,null,0,{"$f":"SUM(D36:D74)+$C$35","v":0},54.51975024,0.81431564219351371,52.777832559667111,52.106819539999996,0.78915719357455416,100.22004370235216,-366.7,152.99787626201928,-100.22004370235216,100.22004370235216,-126.4960774127709,-240.2039225872291,-26.878303814160326,-14.154639788470996,26.878303814160326,14.154639788470996]
[]
[]
[]
[]
[]
[]
[]
[]
[]
[]
[]
[]
[]
[]
[null,null,null,null,null,null,null,null,null,null,null,null,null,null,null,null,null,null,null,null,null,null,null,null,null,null,null,null,null,null,1,15,null,{"$f":"+AF89-H$11","v":-85.22},{"$f":"ABS(AH89)","v":85.22},{"$f":"MIN(AI89:AI102)","v":5.2199999999999989},{"$f":"IF(AJ89=AI89,AE89)","v":false}]
[null,null,null,null,null,null,null,null,null,null,null,null,null,null,null,null,null,null,null,null,null,null,null,null,null,null,null,null,null,null,2,55,null,-45.22,45.22,{"$f":"MIN(AI84:AI104)","v":5.2199999999999989},false]
[null,null,null,null,null,null,null,null,null,null,null,null,null,null,null,null,null,null,null,null,null,null,null,null,null,null,null,null,null,null,3,{"$f":"+AF90+40","v":95},null,-5.2199999999999989,5.2199999999999989,5.2199999999999989,3]
[null,null,null,null,null,null,null,null,null,null,null,null,null,null,null,null,null,null,null,null,null,null,null,null,null,null,null,null,null,null,4,135,null,34.78,34.78,5.2199999999999989,false]
[null,null,null,null,null,null,null,null,null,null,null,null,null,null,null,null,null,null,null,null,null,null,null,null,null,null,null,null,null,null,5,175,null,74.78,74.78,5.2199999999999989,false]
[null,null,null,null,null,null,null,null,null,null,null,null,null,null,null,null,null,null,null,null,null,null,null,null,null,null,null,null,null,null,6,215,null,114.78,114.78,5.2199999999999989,false]
[null,null,null,null,null,null,null,null,null,null,null,null,null,null,null,null,null,null,null,null,null,null,null,null,null,null,null,null,null,null,7,255,null,154.78,154.78,5.2199999999999989,false]
[null,null,null,null,null,null,null,null,null,null,null,null,null,null,null,null,null,null,null,null,null,null,null,null,null,null,null,null,null,null,8,295,null,194.78,194.78,{"$f":"MIN(AI85:AI105)","v":5.2199999999999989},false]
[null,null,null,null,null,null,null,null,null,null,null,null,null,null,null,null,null,null,null,null,null,null,null,null,null,null,null,null,null,null,9,335,null,234.78,234.78,{"$f":"MIN(AI88:AI108)","v":5.2199999999999989},false]
[null,null,null,null,null,null,null,null,null,null,null,null,null,null,null,null,null,null,null,null,null,null,null,null,null,null,null,null,null,null,10,375,null,274.77999999999997,274.77999999999997,{"$f":"MIN(AI87:AI107)","v":5.2199999999999989},false]
[null,null,null,null,null,null,null,null,null,null,null,null,null,null,null,null,null,null,null,null,null,null,null,null,null,null,null,null,null,null,11,415,null,314.77999999999997,314.77999999999997,{"$f":"MIN(AI87:AI107)","v":5.2199999999999989},false]
[null,null,null,null,null,null,null,null,null,null,null,null,null,null,null,null,null,null,null,null,null,null,null,null,null,null,null,null,null,null,12,455,null,354.78,354.78,{"$f":"MIN(AI86:AI106)","v":5.2199999999999989},false]
[null,null,null,null,null,null,null,null,null,null,null,null,null,null,null,null,null,null,null,null,null,null,null,null,null,null,null,null,null,null,13,495,null,394.78,394.78,{"$f":"MIN(AI86:AI106)","v":5.2199999999999989},false]

{"sheet":"LA 4 SUB+ LA 4","index":1,"n_rows":122,"n_cols":84,"rows_kept":122,"cut":false,"hidden":false,"merged":[[0,57,0,58],[174,74,174,75],[67,1,68,1],[172,62,172,64],[174,62,174,63],[72,42,72,43],[93,42,93,43]]}
[]
[null,null,null,null,null,null,null,null,null,null,null,null,null,null,null,null,null,null,null,null,null,null,null,null,null,null,null,null,null,null,null,null,null,null,null,null,null,null,null,null,null,null,null,null,null,null,null,null,null,null,null,null,null,null,null,null,null,"Weight total:",{"$f":"+G9","v":80.650000000000006},"kg","Total weight includes: FR 4 ( 9 kg), Main LS Cables (30 kg)"]
[]
[null,null,null,null,null,null,null,null,null,null,null,null,null,null,null,null,null,null,null,null,null,null,null,null,null,null,null,null,null,null,null,null,null,null,null,null,null,null,null,null,null,null,null,null,null,null,null,null,null,null,null,null,null,null,null,null,null,"2 motors, kg","front motor",null,null,null,null,null,null,null,null,null,null,null,"rear motor"]
[null,null,null,null,null,null,null,null,null,null,null,null,null,null,null,null,null,null,null,null,null,null,null,null,null,null,null,null,null,null,null,null,null,null,null,null,null,null,null,null,null,null,null,null,null,null,null,null,null,null,null,null,null,null,null,null,null,null,{"$f":"+((D9-D10)/D9)*G9","v":63.567984343742744},null,null,null,null,null,null,null,null,null,null,null,{"$f":"+(D10/D9)*G9","v":17.082015656257269}]
[null,null,null,null,null,null,null,null,null,null,null,null,null,null,null,null,null,null,null,null,null,null,null,null,null,null,null,null,null,null,null,null,null,null,null,null,null,null,null,null,null,null,null,null,null,null,null,null,null,null,null,null,null,null,null,null,null,null,null,null,null,null,null,null,null,null,null,null,{"$f":"IF(BR21=12,11)","v":false},null,{"$f":"IF(BR21=12,13)","v":false}]
[null,null,null,null,null,null,null,null,null,null,null,null,null,null,null,null,null,null,null,null,null,null,null,null,null,null,null,null,null,null,null,null,null,null,null,null,null,null,null,null,null,null,null,null,null,null,null,null,null,null,null,null,null,null,null,null,null,null,null,null,null,null,null,null,null,null,{"$f":"IF(BQ21=11,9)","v":false},null,null,null,{"$f":"IF(BQ21=11,13)","v":false}]
[null,null,null,null,null,null,null,null,null,null,null,null,null,null,null,null,null,null,null,null,null,null,null,null,null,null,null,null,null,null,null,null,null,null,null,null,null,null,null,null,null,null,null,null,null,null,null,null,null,null,null,null,null,null,null,null,null,null,null,null,null,null,null,null,{"$f":"IF(BP21=10,7)","v":false},null,null,null,null,null,{"$f":"IF(BP21=10,13)","v":false}]
[null,"L(2motors)=",null,480,null,"G ",{"$f":"+T70+T91+30+9","v":80.650000000000006},null,null,null,null,null,null,null,null,null,null,null,null,null,null,null,null,null,null,null,null,null,null,null,null,null,null,null,null,null,null,null,null,null,null,null,null,null,null,null,null,null,null,null,null,null,null,null,null,null,null,null,null,null,null,null,{"$f":"IF(BO21=9,5)","v":false},null,null,null,null,null,null,null,{"$f":"IF(BO21=9,13)","v":false}]
[null,"a(2motors)=a-15",null,{"$f":"+G11-15","v":101.66605722260989},null,"L ",{"$f":"+AI76","v":152.99803225846358},null,null,{"$f":"AND(D59>=5,E59>=5)","v":true},null,null,null,null,null,null,null,null,null,null,null,null,null,null,null,null,null,null,null,null,null,null,null,null,null,null,null,null,null,null,null,null,null,null,null,null,null,null,null,null,null,null,null,null,null,null,null,null,null,null,{"$f":"IF(BN21=8,3)","v":false},null,null,null,null,null,null,null,null,null,{"$f":"IF(BN21=8,13)","v":false}]
[null,null,null,null,null,"a",{"$f":"+AF76","v":116.66605722260989},null,null,{"$f":"IF(D59>=5,\"O K \",\"OVERLOAD\")","v":"O K "},{"$f":"IF(E59>=5,\"O K \",\"OVERLOAD\")","v":"O K "},null,null,null,null,null,null,null,null,null,null,null,null,null,null,null,null,null,null,null,null,null,null,null,null,null,null,null,null,null,null,null,null,null,null,null,null,null,null,null,null,null,null,null,null,null,null,null,{"$f":"IF(BM21=7,1)","v":false},null,null,null,null,null,null,null,null,null,null,null,{"$f":"IF(BM21=7,13)","v":false}]
[null,null,null,null,null,null,null,null,null,1700,1700,null,null,null,null,null,null,null,null,null,null,null,null,null,null,null,null,null,null,null,null,null,null,null,null,null,null,null,null,null,null,null,null,null,null,null,null,null,null,null,null,null,null,null,null,null,null,null,{"$f":"IF(BM21=61,1)","v":false},null,null,null,null,null,null,null,null,null,null,null,{"$f":"IF(BM21=61,10)","v":false}]
[null,null,null,null,null,null,null,null,null,"Fa=((L-a)/L)*G","Fb=(a/L)*G",null,null,null,null,null,null,null,null,null,null,null,null,null,null,null,null,null,null,null,null,null,null,null,null,null,null,null,null,null,null,null,null,null,null,null,null,null,null,null,null,null,null,null,null,null,null,null,{"$f":"IF(BL21=6,1)","v":false},null,null,null,null,null,null,null,null,null,{"$f":"IF(BL21=6,8)","v":false}]
[null,null,null,null,null,null,null,null,"kg",{"$f":"+((G10-G11)/G10)*G9","v":19.15170896898583},{"$f":"+(G11/G10)*G9","v":61.498291031014176},null,null,null,null,null,null,null,null,null,null,null,null,null,null,null,null,null,null,null,null,null,null,null,null,null,null,null,null,null,null,null,null,null,null,null,null,null,null,null,null,null,null,null,null,null,null,null,{"$f":"IF(BK21=5,1)","v":false},null,null,null,null,null,null,null,{"$f":"IF(BK21=5,9)","v":false}]
[null,null,null,null,null,null,null,null,"k - safety factor\nof FR 4",{"$f":"+J12/J14","v":88.764924464598465},{"$f":"+K12/K14","v":27.643044570826753},null,null,null,null,null,null,null,null,null,null,null,null,null,null,null,null,null,null,null,null,null,null,null,null,null,null,null,null,null,null,null,null,null,null,null,null,null,null,null,null,null,null,null,null,null,null,null,{"$f":"IF(BJ21=4,1)","v":1},null,null,null,null,null,{"$f":"IF(BJ21=4,7)","v":7}]
[null,null,null,null,null,null,null,null,null,null,null,null,null,null,null,null,null,null,null,null,null,null,null,null,null,null,null,null,null,null,null,null,null,null,null,null,null,null,null,null,null,null,null,null,null,null,null,null,null,null,null,null,null,null,null,null,null,null,{"$f":"IF(BI21=3,1)","v":false},null,null,null,{"$f":"IF(BI21=3,5)","v":false}]
[null,null,null,null,null,null,null,null,null,null,null,null,null,null,null,null,null,null,null,null,null,null,null,null,null,null,null,null,null,null,null,null,null,null,null,null,null,null,null,null,null,null,null,null,null,null,null,null,null,null,null,null,null,null,null,null,null,null,{"$f":"IF(BH21=2,1)","v":false},null,{"$f":"IF(BH21=2,3)","v":false}]
[]
[null,null,null,null,null,null,null,null,null,null,null,null,null,null,null,null,null,null,null,null,null,null,null,null,null,null,null,null,null,null,null,null,null,null,null,null,null,null,null,null,null,null,null,null,null,null,null,null,null,null,null,null,null,null,null,null,null,"2 points-one motor",{"$f":"SUM(BG6:BG18)","v":1},0,0,0,0,0,{"$f":"SUM(BM6:BM18)","v":7},0,0,0,{"$f":"SUM(BQ6:BQ18)","v":0},0,0]
[]
[null,null,null,null,null,null,null,null,null,null,null,null,null,null,null,null,null,null,null,null,null,null,null,null,null,null,null,null,null,null,null,null,null,null,null,null,null,null,null,null,null,null,null,null,null,null,null,null,null,null,null,null,null,null,null,null,null,null,{"$f":"+CD32","v":false},{"$f":"+CD33","v":false},{"$f":"+CD34","v":false},{"$f":"+CD35","v":4},{"$f":"+CD36","v":false},{"$f":"+CD37","v":false},{"$f":"+CD38","v":false},{"$f":"+CD39","v":false},{"$f":"+CD40","v":false},{"$f":"+CD41","v":false},{"$f":"+CD42","v":false},{"$f":"+CD43","v":false},{"$f":"+CD44","v":false}]
[null,null,null,null,null,null,null,null,null,null,null,null,null,null,null,null,null,null,null,null,null,null,null,null,null,null,null,null,null,null,null,null,null,null,null,null,null,null,null,null,null,null,null,null,null,null,null,null,null,null,null,null,null,null,null,null,null,"1 point-one motor",{"$f":"+BG21","v":false},{"$f":"+BH21","v":false},false,4,false,false,false,false,false,false,false,false,false]
[null,null,null,null,null,null,null,null,null,null,null,null,null,null,null,null,null,null,null,null,null,null,null,null,null,null,null,null,null,null,null,null,null,null,null,null,null,null,null,null,null,null,null,null,null,null,null,null,null,null,null,null,null,null,null,null,null,null,1,2,3,4,5,6,7,8,9,10,11,12,13]
[]
[]
[null,null,null,null,null,null,null,null,null,null,null,null,null,null,null,null,null,null,null,null,null,null,null,null,null,null,null,null,null,null,null,null,null,null,null,null,null,null,null,null,null,null,null,null,null,null,null,null,null,null,null,null,null,null,null,null,"center  om mass",null,null,null,null,null,null,null,null,null,null,null,null,null,null,null,null,"center  om mass"]
[null,null,null,null,null,null,null,null,null,null,null,null,null,null,null,null,null,null,null,null,null,null,null,null,null,null,null,null,null,null,null,null,null,null,null,null,null,null,null,null,null,null,null,null,null,null,null,null,null,null,null,null,null,null,null,null,{"$f":"-+CA32","v":101.66605722260989},null,null,null,null,null,null,null,null,null,null,null,null,null,null,null,null,{"$f":"+-CA44","v":-378.33394277739012}]
[]
[]
[]
[]
[null,null,null,null,null,null,null,null,null,null,null,null,null,null,null,null,null,null,null,null,null,null,null,null,null,null,null,null,null,null,null,null,null,null,null,null,null,null,null,null,null,null,null,null,null,null,null,null,null,null,null,null,null,null,null,null,null,null,null,null,null,null,null,null,null,null,null,null,null,null,null,null,null,null,null,1,15,null,{"$f":"+BY32-G$11","v":-101.66605722260989},{"$f":"ABS(CA32)","v":101.66605722260989},{"$f":"MIN(CB31:CB44)","v":18.333942777390106},{"$f":"IF(CC32=CB32,BX32)","v":false}]
[null,null,null,null,null,null,null,null,null,null,null,null,null,null,null,null,null,null,null,null,null,null,null,null,null,null,null,null,null,null,null,null,null,null,null,null,null,null,null,null,null,null,null,null,null,null,null,null,null,null,null,null,null,null,null,null,null,null,null,null,null,null,null,null,null,null,null,null,null,null,null,null,null,null,null,2,55,null,-61.666057222609894,61.666057222609894,{"$f":"MIN(CB31:CB44)","v":18.333942777390106},false]
[null,null,null,null,null,null,null,null,null,null,null,null,null,null,null,null,null,null,null,null,null,null,null,null,null,null,null,null,null,null,null,null,null,null,null,null,null,null,null,null,null,null,null,null,null,null,null,null,null,null,null,null,null,null,null,null,null,null,null,null,null,null,null,null,null,null,null,null,null,null,null,null,null,null,null,3,{"$f":"+BY33+40","v":95},null,-21.666057222609894,21.666057222609894,{"$f":"MIN(CB31:CB45)","v":18.333942777390106},false]
[null,null,null,null,null,null,null,null,null,null,null,null,null,null,null,null,null,null,null,null,null,null,null,null,null,null,null,null,null,null,null,null,null,null,null,null,null,null,null,null,null,null,null,null,null,null,null,null,null,null,null,null,null,null,null,null,null,null,null,null,null,null,null,null,null,null,null,null,null,null,null,null,null,null,null,4,135,null,18.333942777390106,18.333942777390106,{"$f":"MIN(CB32:CB45)","v":18.333942777390106},4]
[null,null,null,null,null,null,null,null,null,null,null,null,null,null,null,null,null,null,null,null,null,null,null,null,null,null,null,null,null,null,null,null,null,null,null,null,null,null,null,null,null,null,null,null,null,null,null,null,null,null,null,null,null,null,null,null,null,null,null,null,null,null,null,null,null,null,null,null,null,null,null,null,null,null,null,5,175,null,58.333942777390106,58.333942777390106,{"$f":"MIN(CB32:CB45)","v":18.333942777390106},false]
[null,null,null,null,null,null,null,null,null,null,null,null,null,null,null,null,null,null,null,null,null,null,null,null,null,null,null,null,null,null,null,null,null,null,null,null,null,null,null,null,null,null,null,null,null,null,null,null,null,null,null,null,null,null,null,null,null,null,null,null,null,null,null,null,null,null,null,null,null,null,null,null,null,null,null,6,215,null,98.333942777390106,98.333942777390106,{"$f":"MIN(CB32:CB45)","v":18.333942777390106},false]
[null,null,null,null,null,null,null,null,null,null,null,null,null,null,null,null,null,null,null,null,null,null,null,null,null,null,null,null,null,null,null,null,null,null,null,null,null,null,null,null,null,null,null,null,null,null,null,null,null,null,null,null,null,null,null,null,null,null,null,null,null,null,null,null,null,null,null,null,null,null,null,null,null,null,null,7,255,null,138.33394277739012,138.33394277739012,{"$f":"MIN(CB32:CB45)","v":18.333942777390106},false]
[null,null,null,null,null,null,null,null,null,null,null,null,null,null,null,null,null,null,null,null,null,null,null,null,null,null,null,null,null,null,null,null,null,null,null,null,null,null,null,null,null,null,null,null,null,null,null,null,null,null,null,null,null,null,null,null,null,null,null,null,null,null,null,null,null,null,null,null,null,null,null,null,null,null,null,8,295,null,178.33394277739012,178.33394277739012,{"$f":"MIN(CB32:CB45)","v":18.333942777390106},false]
[null,null,null,null,null,null,null,null,null,null,null,null,null,null,null,null,null,null,null,null,null,null,null,null,null,null,null,null,null,null,null,null,null,null,null,null,null,null,null,null,null,null,null,null,null,null,null,null,null,null,null,null,null,null,null,null,null,null,null,null,null,null,null,null,null,null,null,null,null,null,null,null,null,null,null,9,335,null,218.33394277739012,218.33394277739012,{"$f":"MIN(CB31:CB44)","v":18.333942777390106},false]
[null,null,null,null,null,null,null,null,null,null,null,null,null,null,null,null,null,null,null,null,null,null,null,null,null,null,null,null,null,null,null,null,null,null,null,null,null,null,null,null,null,null,null,null,null,null,null,null,null,null,null,null,null,null,null,null,null,null,null,null,null,null,null,null,null,null,null,null,null,null,null,null,null,null,null,10,375,null,258.33394277739012,258.33394277739012,{"$f":"MIN(CB31:CB44)","v":18.333942777390106},false]
[null,null,null,null,null,null,null,null,null,null,null,null,null,null,null,null,null,null,null,null,null,null,null,null,null,null,null,null,null,null,null,null,null,null,null,null,null,null,null,null,null,null,null,null,null,null,null,null,null,null,null,null,null,null,null,null,null,null,null,null,null,null,null,null,null,null,null,null,null,null,null,null,null,null,null,11,415,null,298.33394277739012,298.33394277739012,{"$f":"MIN(CB32:CB45)","v":18.333942777390106},false]
[null,null,null,null,null,null,null,null,null,null,null,null,null,null,null,null,null,null,null,null,null,null,null,null,null,null,null,null,null,null,null,null,null,null,null,null,null,null,null,null,null,null,null,null,null,null,null,null,null,null,null,null,null,null,null,null,null,null,null,null,null,null,null,null,null,null,null,null,null,null,null,null,null,null,null,12,455,null,338.33394277739012,338.33394277739012,{"$f":"MIN(CB32:CB45)","v":18.333942777390106},false]
[null,null,null,null,null,null,null,null,null,null,null,null,null,null,null,null,null,null,null,null,null,null,null,null,null,null,null,null,null,null,null,null,null,null,null,null,null,null,null,null,null,null,null,null,null,null,null,null,null,null,null,null,null,null,null,null,null,null,null,null,null,null,null,null,null,null,null,null,null,null,null,null,null,null,null,13,495,null,378.33394277739012,378.33394277739012,{"$f":"MIN(CB32:CB45)","v":18.333942777390106},false]
[]
[]
[]
[]
[]
[]
[]
[]
[]
[]
[]
[]
[]
[null,null,null,"front","rear"]
[null,"k - safety factor\nof FR 4",null,{"$f":"ABS(J15)","v":88.764924464598465},{"$f":"ABS(K15)","v":27.643044570826753}]
[]
[]
[null,{"$f":"IF(J10=TRUE,\"O K \",\"OVERLOAD\")","v":"O K "}]
[]
[]
[]
[]
[]
[null,"enter the angle of frame FR 4"]
[null,null,null,{"$f":"IF(BE27>0,\" \",\"change the angle of frame or of cabinets\")","v":" "}]
[null,0,null,{"$f":"IF(BV27<0,\" \",\"change the angle of frame or of cabinets\")","v":" "},null,null,null,null,null,null,null,null,null,null,null,null,null,null,"G LA 4",{"$f":"+B73*32","v":32}]
[null,null,null,null,null,null,null,null,null,null,null,null,null,null,null,null,null,null,"L LA 4",153]
[null,"enter the number of cabinets from 1 up to 12",null,null,null,null,null,null,null,null,null,null,null,null,null,null,null,null,"x sc 8"]
[null,1,null,"LA 4 SUB",null,null,null,null,null,null,null,null,null,null,null,null,null,null,null,null,null,null,null,null,null,null,null,null,null,null,null,null,null,null,null,null,null,null,null,null,null,null,"k - safety factor"]
[null,null,null,null,null,null,null,"d","K","b","b/2","sin b/2","c=sin(b/2)*d","2c","e=a/2","sin(e)","f=sin(e)*2c","g center of  mass -x","h=g+f","center of mass X",null,null,null,null,null,null,null,null,null,null,null,"САМО ЗА LA 4 SUB И LA 4",null,"САМО ЗА LA 4 SUB И LA 4",null,null,"САМО ЗА LA 4 SUB И LA 4"]
[null,null,null,null,null,null,null,null,null,null,null,null,null,null,null,null,null,null,null,null,null,null,null,"z- център на тежест на боксовете след него спрямо първата колона","a - общ ъгъл","t= 58.15-a","sin t","m= sin t *n(const)","a","sin r","p= sin r *q(const)","x= (SUM Gi*xi)/G\n","g SC8 - тегло на боксожете под тази ","G\ng SC8+LA 12 - тегло на боксожете под тази +LA12","L=m-p","J=x-p","Asc8+la12 =x-J","Asc8=z-J","Fa=((L-A)/L)*G","Fb=(A/L)*G","front","rear","front","rear"]
[null,1,{"$f":"+(B70*-1)+D76","v":0},0,null,null,null,323.5,88.872906259999993,{"$f":"+I76-C76","v":88.872906259999993},{"$f":"+J76/2","v":44.436453129999997},{"$f":"SIN(K76*3.14159265358979/180)","v":0.70011776578649665},{"$f":"+L76*H76","v":226.48809723193168},{"$f":"+M76*2","v":452.97619446386335},{"$f":"+C76/2","v":0},{"$f":"SIN(O76*3.14159265358979/180)","v":0},{"$f":"+P76*N76","v":0},231,{"$f":"+R76+Q76","v":231},{"$f":"+S76","v":231},null,{"$f":"IF(B76<($B$73+1),T76,0)","v":231},null,{"$f":"SUM(V76:V87)/($B$73)","v":231},{"$f":"+D76+C76","v":0},{"$f":"157.42570277-$Y$76","v":157.42570276999999},{"$f":"SIN(Z76*3.14159265358979/180)","v":0.38388113378270589},{"$f":"+AA76*203.18","v":77.99696876197018},{"$f":"45.56354687+$Y$76","v":45.563546870000003},{"$f":"SIN(AC76*3.14159265358979/180)","v":0.71402739025202855},{"$f":"+AD76*323.51","v":230.99500102043376},{"$f":"+((X76*AG76)+($AG$97*$X$97))/AH76","v":116.66605722260989},{"$f":"32*B73","v":32},{"$f":"+AG76+$AG$97+30","v":71.650000000000006},{"$f":"+AE76-AB76","v":152.99803225846358},{"$f":"+V76-AE76","v":4.998979566238404E-3},{"$f":"+AF76-AJ76","v":116.66105824304366},{"$f":"+X76-AJ76","v":230.99500102043376},{"$f":"+((AI76-AK76)/AI76)*AH76","v":17.016847535702961},{"$f":"+(AK76/AI76)*AH76","v":54.633152464297048},{"$f":"2*$J$12/AM76","v":199.80198993182947},{"$f":"2*$K$12/AN76","v":62.233274973870707},{"$f":"ABS(AO76)","v":199.80198993182947},{"$f":"ABS(AP76)","v":62.233274973870707}]
[null,2,null,0,null,null,null,323.5,88.872906259999993,{"$f":"+I77-D77","v":88.872906259999993},44.436453129999997,0.70011776578649665,226.48809723193168,452.97619446386335,{"$f":"+C76+(D77/2)","v":0},0,0,{"$f":"+T76","v":231},{"$f":"+R77+Q77","v":231},231,null,0,null,{"$f":"SUM(V77:V87)/($B$73-B76)","v":{"$error":"#DIV/0!"}},null,{"$f":"157.42570277-$Y$76","v":157.42570276999999},{"$f":"SIN(Z77*3.14159265358979/180)","v":0.38388113378270589},{"$f":"+AA77*203.18","v":77.99696876197018},{"$f":"45.56354687+$Y$76","v":45.563546870000003},{"$f":"SIN(AC77*3.14159265358979/180)","v":0.71402739025202855},{"$f":"+AD77*323.51","v":230.99500102043376},{"$f":"+((X77*AG77)+($AG$97*$X$97))/AH77","v":{"$error":"#DIV/0!"}},{"$f":"32*($B$73-B76)","v":0},{"$f":"+AG77+$AG$97+30","v":39.65},{"$f":"+AE77-AB77","v":152.99803225846358},{"$f":"+V77-AE77","v":-230.99500102043376},{"$f":"+AF77-AJ77","v":{"$error":"#DIV/0!"}},{"$f":"+X77-AJ77","v":{"$error":"#DIV/0!"}},{"$f":"+((AI77-AK77)/AI77)*AH77","v":{"$error":"#DIV/0!"}},{"$f":"+(AK77/AI77)*AH77","v":{"$error":"#DIV/0!"}},{"$error":"#DIV/0!"},{"$error":"#DIV/0!"},{"$f":"ABS(AO77)","v":{"$error":"#DIV/0!"}},{"$f":"ABS(AP77)","v":{"$error":"#DIV/0!"}}]
[null,3,null,0,null,null,null,323.5,88.872906259999993,88.872906259999993,44.436453129999997,0.70011776578649665,226.48809723193168,452.97619446386335,{"$f":"+C76+D77+(D78/2)","v":0},0,0,231,{"$f":"+S77+Q78","v":231},231,null,0,null,{"$f":"SUM(V78:V87)/($B$73-B77)","v":0},null,157.42570276999999,{"$f":"SIN(Z78*3.14159265358979/180)","v":0.38388113378270589},77.99696876197018,45.563546870000003,0.71402739025202855,230.99500102043376,126.42130718954252,{"$f":"32*($B$73-B77)","v":-32},7.6499999999999986,152.99803225846358,{"$f":"+V78-AE78","v":-230.99500102043376},357.41630820997625,{"$f":"+X78-AJ78","v":230.99500102043376},-10.221045251008874,17.871045251008873,-332.64699612443269,190.25188243021543,332.64699612443269,190.25188243021543]
[null,4,null,0,null,null,null,323.5,88.872906259999993,88.872906259999993,44.436453129999997,0.70011776578649665,226.48809723193168,452.97619446386335,{"$f":"+C76+D77+D78+(D79/2)","v":0},0,0,231,231,231,null,0,null,{"$f":"SUM(V79:V87)/($B$73-B78)","v":0},null,157.42570276999999,0.38388113378270589,77.99696876197018,45.563546870000003,0.71402739025202855,230.99500102043376,-39.717577002053389,-64,-24.35,152.99803225846358,{"$f":"+V79-AE79","v":-230.99500102043376},191.27742401838037,{"$f":"+X79-AJ79","v":230.99500102043376},6.0922560610410184,-30.442256061041022,558.0855377603782,-111.68686030307741,558.0855377603782,111.68686030307741]
[null,5,null,0,null,null,null,323.5,88.872906259999993,88.872906259999993,44.436453129999997,0.70011776578649665,226.48809723193168,452.97619446386335,{"$f":"+C76+D77+D78+D79+(D80/2)","v":0},0,0,231,231,231,null,0,null,{"$f":"SUM(V80:V87)/($B$73-B79)","v":0},null,157.42570276999999,0.38388113378270589,77.99696876197018,45.563546870000003,0.71402739025202855,230.99500102043376,-17.16278615794144,-96,-56.349999999999994,152.99803225846358,{"$f":"+V80-AE80","v":-230.99500102043376},213.83221486249232,230.99500102043376,22.405557373090907,-78.755557373090895,151.74806604380228,-43.171556565755552,151.74806604380228,43.171556565755552]
[null,6,null,0,null,null,null,323.5,88.872906259999993,88.872906259999993,44.436453129999997,0.70011776578649665,226.48809723193168,452.97619446386335,{"$f":"+C76+D77+D78+D79+D80+(D81/2)","v":0},0,0,231,231,231,null,0,null,{"$f":"SUM(V81:V87)/($B$73-B80)","v":0},null,157.42570276999999,0.38388113378270589,77.99696876197018,45.563546870000003,0.71402739025202855,230.99500102043376,-10.946496887379741,-128,-88.35,152.99803225846358,-230.99500102043376,220.04850413305402,230.99500102043376,38.718858685140802,-127.0688586851408,87.812505726177918,-26.757145969373454,87.812505726177918,26.757145969373454]
[null,7,null,0,null,null,null,323.5,88.872906259999993,88.872906259999993,44.436453129999997,0.70011776578649665,226.48809723193168,452.97619446386335,{"$f":"+C76+D77+D78+D79+D80+D81+(D82/2)","v":0},0,0,231,231,231,null,0,null,{"$f":"SUM(V82:V87)/($B$73-B81)","v":0},null,157.42570276999999,0.38388113378270589,77.99696876197018,45.563546870000003,0.71402739025202855,230.99500102043376,-8.0359202326547585,-160,-120.35,152.99803225846358,-230.99500102043376,222.95908078777902,230.99500102043376,55.032159997190703,-175.38215999719071,61.782056168130858,-19.386236319899705,61.782056168130858,19.386236319899705]
[null,8,null,0,null,null,null,323.5,88.872906259999993,88.872906259999993,44.436453129999997,0.70011776578649665,226.48809723193168,452.97619446386335,{"$f":"+C76+D77+D78+D79+D80+D81+D82+(D83/2)","v":0},0,0,231,231,231,null,0,null,{"$f":"SUM(V83:V87)/($B$73-B82)","v":0},null,157.42570276999999,0.38388113378270589,77.99696876197018,45.563546870000003,0.71402739025202855,230.99500102043376,-6.3480341319330496,-192,-152.35,152.99803225846358,-230.99500102043376,224.64696688850071,230.99500102043376,71.345461309240576,-223.69546130924059,47.655449100861532,-15.199235514661513,47.655449100861532,15.199235514661513]
[null,9,null,0,null,null,null,323.5,88.872906259999993,88.872906259999993,44.436453129999997,0.70011776578649665,226.48809723193168,452.97619446386335,{"$f":"+C76+D77+D78+D79+D80+D81+D82+D83+(D84/2)","v":0},0,0,231,231,231,null,0,null,{"$f":"SUM(V84:V87)/($B$73-B83)","v":0},null,157.42570276999999,0.38388113378270589,77.99696876197018,45.563546870000003,0.71402739025202855,230.99500102043376,-5.2461242202332521,-224,-184.35,152.99803225846358,-230.99500102043376,225.74887680020052,230.99500102043376,87.658762621290492,-272.00876262129049,38.786766985166302,-12.499597318979449,38.786766985166302,12.499597318979449]
[null,10,null,0,null,null,null,323.5,88.872906259999993,88.872906259999993,44.436453129999997,0.70011776578649665,226.48809723193168,452.97619446386335,{"$f":"+C76+D77+D78+D79+D80+D81+D82+D83+D84+(D85/2)","v":0},0,0,231,231,231,null,0,null,{"$f":"SUM(V85:V87)/($B$73-B84)","v":0},null,157.42570276999999,0.38388113378270589,77.99696876197018,45.563546870000003,0.71402739025202855,230.99500102043376,-4.4701779523919578,-256,-216.35,152.99803225846358,-230.99500102043376,226.5248230680418,230.99500102043376,103.97206393334037,-320.32206393334036,32.701091729600009,-10.614317222642354,32.701091729600009,10.614317222642354]
[null,11,null,0,null,null,null,323.5,88.872906259999993,88.872906259999993,44.436453129999997,0.70011776578649665,226.48809723193168,452.97619446386335,{"$f":"+C76+D77+D78+D79+D80+D81+D82+D83+D84+D85+(D86/2)","v":0},0,0,231,231,231,null,0,null,{"$f":"SUM(V86:V87)/($B$73-B85)","v":0},null,157.42570276999999,0.38388113378270589,77.99696876197018,45.563546870000003,0.71402739025202855,230.99500102043376,-3.8941936782766255,-288,-248.35000000000002,152.99803225846358,-230.99500102043376,227.10080734215714,230.99500102043376,120.28536524539028,-368.63536524539035,28.266115275651117,-9.2232062372439891,28.266115275651117,9.2232062372439891]
[null,12,null,0,null,null,null,323.5,88.872906259999993,88.872906259999993,44.436453129999997,0.70011776578649665,226.48809723193168,452.97619446386335,{"$f":"+C76+D77+D78+D79+D80+D81+D82+D83+D84+D85+D86+(D87/2)","v":0},0,0,231,231,231,null,0,null,{"$f":"SUM(V87)/($B$73-B86)","v":0},null,157.42570276999999,0.38388113378270589,77.99696876197018,45.563546870000003,0.71402739025202855,230.99500102043376,-3.4496985910469053,-320,-280.35000000000002,152.99803225846358,-230.99500102043376,227.54530242938685,230.99500102043376,136.59866655744017,-416.94866655744016,24.890433308661102,-8.1544810493634365,24.890433308661102,8.1544810493634365]
[]
[]
[]
[null,null,null,null,null,null,null,null,null,null,null,null,null,null,null,null,null,null,"G LA 4",{"$f":"+B94*9.65","v":9.65}]
[null,null,null,null,null,null,null,null,null,null,null,null,null,null,null,null,null,null,"L LA 4",153]
[null,"enter the number of cabinets from 1 up to 24",null,null,null,null,null,null,null,null,null,null,null,null,null,null,null,null,"x LA 4",{"$f":"SUM(V97:V120)/B94","v":100.22}]
[null,1,null,"LA 4",null,null,null,null,null,null,null,null,null,null,null,null,null,null,null,null,null,null,null,null,null,null,null,null,null,null,null,null,null,null,null,null,null,null,null,null,null,null,"k - safety factor"]
[null,null,null,null,null,null,null,"d","k ","b","b/2","sin b/2","c=sin(b/2)*d","2c","e=a/2","sin(e)","f=sin(e)*2c","g center of  mass -x","h=g+f","center of mass X",null,null,null,null,null,null,null,null,null,null,null,null,null,null,null,null,null,null,null,null,"НЕ РАБОТИ ЦВЕТОВЕТЕ!!!"]
[null,null,null,"enter the value of a-angle",null,null,null,null,null,null,null,null,null,null,null,null,null,null,null,null,null,null,null,"z- център на тежест на боксовете след него спрямо първата колона","a - общ ъгъл","t= 54.51-a","sin t","m= sin t *n(const)","r= 52.1+a","sin r","p= sin r *q(const)",null,"g - тегло на боксожете под тази ",null,"L=m+n","J=x-p",null,"A=z-J","Fa=((L-A)/L)*G","Fb=(A/L)*G","front","rear","front","rear"]
[null,1,{"$f":"+(B70*-1)+D97","v":0},0,"from 0 to 10",null,{"$f":"+D97","v":0},127,75.786360920000007,{"$f":"+I97-C97","v":75.786360920000007},{"$f":"+J97/2","v":37.893180460000004},{"$f":"SIN(K97*3.14159265358979/180)","v":0.61419127625645442},{"$f":"+L97*H97","v":78.002292084569717},{"$f":"+M97*2","v":156.00458416913943},{"$f":"+C97/2","v":0},{"$f":"SIN(O97*3.14159265358979/180)","v":0},{"$f":"+P97*N97","v":0},100.22,{"$f":"+R97+Q97","v":100.22},{"$f":"+S97","v":100.22},null,{"$f":"IF(B97<($B$94+1),T97,0)","v":100.22},null,{"$f":"SUM(V97:V120)/($B$94)","v":100.22},{"$f":"C97","v":0},{"$f":"54.51975024-Y97","v":54.51975024},{"$f":"SIN(Z97*3.14159265358979/180)","v":0.81431564219351371},{"$f":"+AA97*64.8125","v":52.777832559667111},{"$f":"52.10681954+Y97","v":52.106819539999996},{"$f":"SIN(AC97*3.14159265358979/180)","v":0.78915719357455416},{"$f":"+AD97*126.9963","v":100.22004370235216},null,{"$f":"9.65*B94","v":9.65},null,{"$f":"+AE97+AB97","v":152.99787626201928},{"$f":"+V97-AE97","v":-4.3702352158447866E-5},null,{"$f":"+X97-AJ97","v":100.22004370235216},{"$f":"+((AI97-AL97)/AI97)*AG97","v":3.3288441424413397},{"$f":"+(AL97/AI97)*AG97","v":6.3211558575586606},{"$f":"2*$J$12/AM97","v":1021.3755449380923},{"$f":"2*$K$12/AN97","v":537.87631196189784},{"$f":"ABS(AO97)","v":1021.3755449380923},{"$f":"ABS(AP97)","v":537.87631196189784}]
[null,2,null,0,"from 0 to 20",null,{"$f":"+D98+AS98","v":0},127,75.786360920000007,{"$f":"+I98-D98","v":75.786360920000007},37.893180460000004,0.61419127625645442,78.002292084569717,156.00458416913943,{"$f":"+C97+(D98/2)","v":0},0,0,{"$f":"+T97","v":100.22},{"$f":"+R98+Q98","v":100.22},100.22,null,0,null,{"$f":"SUM(V98:V121)/($B$94-B97)","v":{"$error":"#DIV/0!"}},{"$f":"SUM(D98)+$C$97","v":0},{"$f":"54.51975024-Y98","v":54.51975024},0.81431564219351371,{"$f":"+AA98*64.8125","v":52.777832559667111},{"$f":"52.10681954+Y98","v":52.106819539999996},{"$f":"SIN(AC98*3.14159265358979/180)","v":0.78915719357455416},{"$f":"+AD98*126.9963","v":100.22004370235216},null,{"$f":"9.65*($B$94-B97)","v":0},null,{"$f":"+AE98+AB98","v":152.99787626201928},{"$f":"+V98-AE98","v":-100.22004370235216},null,{"$f":"+X98-AJ98","v":{"$error":"#DIV/0!"}},{"$f":"+((AI98-AL98)/AI98)*AG98","v":{"$error":"#DIV/0!"}},{"$f":"+(AL98/AI98)*AG98","v":{"$error":"#DIV/0!"}},{"$error":"#DIV/0!"},{"$f":"2*$K$12/AN98","v":{"$error":"#DIV/0!"}},{"$f":"ABS(AO98)","v":{"$error":"#DIV/0!"}},{"$error":"#DIV/0!"}]
[null,3,null,0,"from 0 to 20",null,{"$f":"+D99+AS99","v":0},127,75.786360920000007,75.786360920000007,37.893180460000004,0.61419127625645442,78.002292084569717,156.00458416913943,{"$f":"+C97+D98+(D99/2)","v":0},0,0,100.22,{"$f":"+S98+Q99","v":100.22},100.22,null,0,null,{"$f":"SUM(V99:V122)/($B$94-B98)","v":0},{"$f":"SUM(D98:D99)+$C$97","v":0},54.51975024,0.81431564219351371,52.777832559667111,52.106819539999996,0.78915719357455416,100.22004370235216,null,{"$f":"9.65*($B$94-B98)","v":-9.65},null,152.99787626201928,{"$f":"+V99-AE99","v":-100.22004370235216},null,{"$f":"+X99-AJ99","v":100.22004370235216},-3.3288441424413397,-6.3211558575586606,-1021.3755449380923,-537.87631196189784,1021.3755449380923,537.87631196189784]
[null,4,null,6,"from 0 to 20",null,6,127,75.786360920000007,69.786360920000007,34.893180460000004,0.57204825210657873,72.650128017535494,145.30025603507099,{"$f":"+C97+D98+D99+(D100/2)","v":3},5.2335956242943779E-2,7.6044278419400033,100.22,107.82442784194001,107.82442784194001,null,0,null,0,{"$f":"SUM(D98:D100)+$C$97","v":6},48.51975024,0.74918408586881602,48.556493565372641,58.106819539999996,0.84903457815675887,107.8242499979692,null,-19.3,null,156.38074356334184,{"$f":"+V100-AE100","v":-107.8242499979692},null,{"$f":"+X100-AJ100","v":107.8242499979692},-5.9926836543791229,-13.30731634562088,-567.35849847763404,-255.49854769319126,567.35849847763404,255.49854769319126]
[null,5,null,0,"from 0 to 20",null,{"$f":"+D101+AS101","v":0},127,75.786360920000007,75.786360920000007,37.893180460000004,0.61419127625645442,78.002292084569717,156.00458416913943,{"$f":"+C97+D98+D99+D100+(D101/2)","v":6},0.10452846326765336,16.306919445909429,107.82442784194001,124.13134728784944,124.13134728784944,null,0,null,0,{"$f":"SUM(D98:D101)+$C$97","v":6},48.51975024,0.74918408586881602,48.556493565372641,58.106819539999996,0.84903457815675887,107.8242499979692,null,-28.950000000000003,null,156.38074356334184,{"$f":"+V101-AE101","v":-107.8242499979692},null,107.8242499979692,-8.9890254815686852,-19.960974518431321,-378.23899898508932,-170.33236512879415,378.23899898508932,170.33236512879415]
[null,6,null,0,"from 0 to 20",null,0,127,75.786360920000007,75.786360920000007,37.893180460000004,0.61419127625645442,78.002292084569717,156.00458416913943,{"$f":"+C97+D98+D99+D100+D101+(D102/2)","v":6},0.10452846326765336,16.306919445909429,124.13134728784944,140.43826673375887,140.43826673375887,null,0,null,0,{"$f":"SUM(D98:D102)+$C$97","v":6},48.51975024,0.74918408586881602,48.556493565372641,58.106819539999996,0.84903457815675887,107.8242499979692,null,-38.6,null,156.38074356334184,-107.8242499979692,null,107.8242499979692,-11.985367308758246,-26.614632691241759,-283.67924923881702,-127.74927384659563,283.67924923881702,127.74927384659563]
[null,7,null,0,"from 0 to 20",null,0,127,75.786360920000007,75.786360920000007,37.893180460000004,0.61419127625645442,78.002292084569717,156.00458416913943,{"$f":"+C97+D98+D99+D100+D101+D102+(D103/2)","v":6},0.10452846326765336,16.306919445909429,140.43826673375887,156.74518617966828,156.74518617966828,null,0,null,0,{"$f":"SUM(D98:D103)+$C$97","v":6},48.51975024,0.74918408586881602,48.556493565372641,58.106819539999996,0.84903457815675887,107.8242499979692,null,-48.25,null,156.38074356334184,-107.8242499979692,null,107.8242499979692,-14.981709135947806,-33.268290864052197,-226.94339939105362,-102.19941907727652,226.94339939105362,102.19941907727652]
[null,8,null,0,"from 0 to 20",null,0,127,75.786360920000007,75.786360920000007,37.893180460000004,0.61419127625645442,78.002292084569717,156.00458416913943,{"$f":"+C97+D98+D99+D100+D101+D102+D103+(D104/2)","v":6},0.10452846326765336,16.306919445909429,156.74518617966828,173.05210562557772,173.05210562557772,null,0,null,0,{"$f":"SUM(D98:D104)+$C$97","v":6},48.51975024,0.74918408586881602,48.556493565372641,58.106819539999996,0.84903457815675887,107.8242499979692,null,-57.900000000000006,null,156.38074356334184,-107.8242499979692,null,107.8242499979692,-17.97805096313737,-39.921949036862642,-189.11949949254466,-85.166182564397076,189.11949949254466,85.166182564397076]
[null,9,null,0,"from 0 to 20",null,0,127,75.786360920000007,75.786360920000007,37.893180460000004,0.61419127625645442,78.002292084569717,156.00458416913943,{"$f":"+C97+D98+D99+D100+D101+D102+D103+D104+(D105/2)","v":6},0.10452846326765336,16.306919445909429,173.05210562557772,189.35902507148717,189.35902507148717,null,0,null,0,{"$f":"SUM(D98:D105)+$C$97","v":6},48.51975024,0.74918408586881602,48.556493565372641,58.106819539999996,0.84903457815675887,107.8242499979692,null,-67.55,null,156.38074356334184,-107.8242499979692,null,107.8242499979692,-20.974392790326927,-46.575607209673073,-162.1024281364669,-72.999585055197514,162.1024281364669,72.999585055197514]
[null,10,null,0,"from 0 to 20",null,0,127,75.786360920000007,75.786360920000007,37.893180460000004,0.61419127625645442,78.002292084569717,156.00458416913943,{"$f":"+C97+D98+D99+D100+D101+D102+D103+D104+D105+(D106/2)","v":6},0.10452846326765336,16.306919445909429,189.35902507148717,205.66594451739661,205.66594451739661,null,0,null,0,{"$f":"SUM(D98:D106)+$C$97","v":6},48.51975024,0.74918408586881602,48.556493565372641,58.106819539999996,0.84903457815675887,107.8242499979692,null,-77.2,null,156.38074356334184,-107.8242499979692,null,107.8242499979692,-23.970734617516491,-53.229265382483518,-141.83962461940851,-63.874636923297814,141.83962461940851,63.874636923297814]
[null,11,null,0,"from 0 to 20",null,0,127,75.786360920000007,75.786360920000007,37.893180460000004,0.61419127625645442,78.002292084569717,156.00458416913943,{"$f":"+C97+D98+D99+D100+D101+D102+D103+D104+D105+D106+(D107/2)","v":6},0.10452846326765336,16.306919445909429,205.66594451739661,221.97286396330605,221.97286396330605,null,0,null,0,{"$f":"SUM(D98:D107)+$C$97","v":6},48.51975024,0.74918408586881602,48.556493565372641,58.106819539999996,0.84903457815675887,107.8242499979692,null,-86.850000000000009,null,156.38074356334184,-107.8242499979692,null,107.8242499979692,-26.967076444706056,-59.882923555293956,-126.0796663283631,-56.777455042931393,126.0796663283631,56.777455042931393]
[null,12,null,0,"from 0 to 20",null,0,127,75.786360920000007,75.786360920000007,37.893180460000004,0.61419127625645442,78.002292084569717,156.00458416913943,{"$f":"+C97+D98+D99+D100+D101+D102+D103+D104+D105+D106+D107+(D108/2)","v":6},0.10452846326765336,16.306919445909429,221.97286396330605,238.2797834092155,238.2797834092155,null,0,null,0,{"$f":"SUM(D98:D108)+$C$97","v":6},48.51975024,0.74918408586881602,48.556493565372641,58.106819539999996,0.84903457815675887,107.8242499979692,null,-96.5,null,156.38074356334184,-107.8242499979692,null,107.8242499979692,-29.963418271895613,-66.536581728104395,-113.47169969552681,-51.099709538638258,113.47169969552681,51.099709538638258]
[null,13,null,0,"from 0 to 20",null,0,127,75.786360920000007,75.786360920000007,37.893180460000004,0.61419127625645442,78.002292084569717,156.00458416913943,{"$f":"+C97+D98+D99+D100+D101+D102+D103+D104+D105+D106+D107+D108+(D109/2)","v":6},0.10452846326765336,16.306919445909429,238.2797834092155,254.58670285512494,254.58670285512494,null,0,null,0,{"$f":"SUM(D98:D109)+$C$97","v":6},48.51975024,0.74918408586881602,48.556493565372641,58.106819539999996,0.84903457815675887,107.8242499979692,null,-106.15,null,156.38074356334184,-107.8242499979692,null,107.8242499979692,-32.959760099085173,-73.190239900914833,-103.15609063229711,-46.454281398762049,103.15609063229711,46.454281398762049]
[null,14,null,0,"from 0 to 20",null,0,127,75.786360920000007,75.786360920000007,37.893180460000004,0.61419127625645442,78.002292084569717,156.00458416913943,{"$f":"+C97+D98+D99+D100+D101+D102+D103+D104+D105+D106+D107+D108+D109+(D110/2)","v":6},0.10452846326765336,16.306919445909429,254.58670285512494,270.89362230103438,270.89362230103438,null,0,null,0,{"$f":"SUM(D98:D110)+$C$97","v":6},48.51975024,0.74918408586881602,48.556493565372641,58.106819539999996,0.84903457815675887,107.8242499979692,null,-115.80000000000001,null,156.38074356334184,-107.8242499979692,null,107.8242499979692,-35.956101926274741,-79.843898073725285,-94.559749746272331,-42.583091282198538,94.559749746272331,42.583091282198538]
[null,15,null,0,"from 0 to 20",null,0,127,75.786360920000007,75.786360920000007,37.893180460000004,0.61419127625645442,78.002292084569717,156.00458416913943,{"$f":"+C97+D98+D99+D100+D101+D102+D103+D104+D105+D106+D107+D108+D109+D110+(D111/2)","v":6},0.10452846326765336,16.306919445909429,270.89362230103438,287.20054174694383,287.20054174694383,null,0,null,0,{"$f":"SUM(D98:D111)+$C$97","v":6},48.51975024,0.74918408586881602,48.556493565372641,58.106819539999996,0.84903457815675887,107.8242499979692,null,-125.45,null,156.38074356334184,-107.8242499979692,null,107.8242499979692,-38.952443753464301,-86.497556246535709,-87.285922842712921,-39.307468875875585,87.285922842712921,39.307468875875585]
[null,16,null,0,"from 0 to 20",null,0,127,75.786360920000007,75.786360920000007,37.893180460000004,0.61419127625645442,78.002292084569717,156.00458416913943,{"$f":"+C97+D98+D99+D100+D101+D102+D103+D104+D105+D106+D107+D108+D109+D110+D111+(D112/2)","v":6},0.10452846326765336,16.306919445909429,287.20054174694383,303.50746119285327,303.50746119285327,null,0,null,0,{"$f":"SUM(D98:D112)+$C$97","v":6},48.51975024,0.74918408586881602,48.556493565372641,58.106819539999996,0.84903457815675887,107.8242499979692,null,-135.1,null,156.38074356334184,-107.8242499979692,null,107.8242499979692,-41.948785580653855,-93.151214419346147,-81.051214068233449,-36.499792527598757,81.051214068233449,36.499792527598757]
[null,17,null,0,"from 0 to 20",null,0,127,75.786360920000007,75.786360920000007,37.893180460000004,0.61419127625645442,78.002292084569717,156.00458416913943,{"$f":"+C97+D98+D99+D100+D101+D102+D103+D104+D105+D106+D107+D108+D109+D110+D111+D112+(D113/2)","v":6},0.10452846326765336,16.306919445909429,303.50746119285327,319.81438063876271,319.81438063876271,null,0,null,0,{"$f":"SUM(D98:D113)+$C$97","v":6},48.51975024,0.74918408586881602,48.556493565372641,58.106819539999996,0.84903457815675887,107.8242499979692,null,-144.75,null,156.38074356334184,-107.8242499979692,null,107.8242499979692,-44.945127407843422,-99.804872592156585,-75.647799797017868,-34.066473025758839,75.647799797017868,34.066473025758839]
[null,18,null,0,"from 0 to 20",null,0,127,75.786360920000007,75.786360920000007,37.893180460000004,0.61419127625645442,78.002292084569717,156.00458416913943,{"$f":"+C97+D98+D99+D100+D101+D102+D103+D104+D105+D106+D107+D108+D109+D110+D111+D112+D113+(D114/2)","v":6},0.10452846326765336,16.306919445909429,319.81438063876271,336.12130008467216,336.12130008467216,null,0,null,0,{"$f":"SUM(D98:D114)+$C$97","v":6},48.51975024,0.74918408586881602,48.556493565372641,58.106819539999996,0.84903457815675887,107.8242499979692,null,-154.4,null,156.38074356334184,-107.8242499979692,null,107.8242499979692,-47.941469235032983,-106.45853076496704,-70.919812309704255,-31.937318461648907,70.919812309704255,31.937318461648907]
[null,19,null,0,"from 0 to 20",null,0,127,75.786360920000007,75.786360920000007,37.893180460000004,0.61419127625645442,78.002292084569717,156.00458416913943,{"$f":"+C97+D98+D99+D100+D101+D102+D103+D104+D105+D106+D107+D108+D109+D110+D111+D112+D113+D114+(D115/2)","v":6},0.10452846326765336,16.306919445909429,336.12130008467216,352.4282195305816,352.4282195305816,null,0,null,0,{"$f":"SUM(D97:D115)+$C$97","v":6},48.51975024,0.74918408586881602,48.556493565372641,58.106819539999996,0.84903457815675887,107.8242499979692,null,-164.05,null,156.38074356334184,-107.8242499979692,null,107.8242499979692,-50.937811062222544,-113.11218893777747,-66.74805864442753,-30.058652669787207,66.74805864442753,30.058652669787207]
[null,20,null,0,"from 0 to 20",null,0,127,75.786360920000007,75.786360920000007,37.893180460000004,0.61419127625645442,78.002292084569717,156.00458416913943,{"$f":"+C97+D98+D99+D100+D101+D102+D103+D104+D105+D106+D107+D108+D109+D110+D111+D112+D113+D114+D115+(D116/2)","v":6},0.10452846326765336,16.306919445909429,352.4282195305816,368.73513897649104,368.73513897649104,null,0,null,0,{"$f":"SUM(D98:D116)+$C$97","v":6},48.51975024,0.74918408586881602,48.556493565372641,58.106819539999996,0.84903457815675887,107.8242499979692,null,-173.70000000000002,null,156.38074356334184,-107.8242499979692,null,107.8242499979692,-53.934152889412111,-119.76584711058791,-63.039833164181552,-28.388727521465697,63.039833164181552,28.388727521465697]
[null,21,null,0,"from 0 to 20",null,0,127,75.786360920000007,75.786360920000007,37.893180460000004,0.61419127625645442,78.002292084569717,156.00458416913943,{"$f":"+C97+D98+D99+D100+D101+D102+D103+D104+D105+D106+D107+D108+D109+D110+D111+D112+D113+D114+D115+D116+(D117/2)","v":6},0.10452846326765336,16.306919445909429,368.73513897649104,385.04205842240049,385.04205842240049,null,0,null,0,{"$f":"SUM(D98:D117)+$C$97","v":6},48.51975024,0.74918408586881602,48.556493565372641,58.106819539999996,0.84903457815675887,107.8242499979692,null,-183.35,null,156.38074356334184,-107.8242499979692,null,107.8242499979692,-56.930494716601665,-126.41950528339834,-59.721947208172004,-26.894583967704349,59.721947208172004,26.894583967704349]
[null,22,null,0,"from 0 to 20",null,0,127,75.786360920000007,75.786360920000007,37.893180460000004,0.61419127625645442,78.002292084569717,156.00458416913943,{"$f":"+C97+D98+D99+D100+D101+D102+D103+D104+D105+D106+D107+D108+D109+D110+D111+D112+D113+D114+D115+D116+D117+(D118/2)","v":6},0.10452846326765336,16.306919445909429,385.04205842240049,401.34897786830993,401.34897786830993,null,0,null,0,{"$f":"SUM(D98:D118)+$C$97","v":6},48.51975024,0.74918408586881602,48.556493565372641,58.106819539999996,0.84903457815675887,107.8242499979692,null,-193,null,156.38074356334184,-107.8242499979692,null,107.8242499979692,-59.926836543791225,-133.07316345620879,-56.735849847763404,-25.549854769319129,56.735849847763404,25.549854769319129]
[null,23,null,0,"from 0 to 20",null,0,127,75.786360920000007,75.786360920000007,37.893180460000004,0.61419127625645442,78.002292084569717,156.00458416913943,{"$f":"+C97+D98+D99+D100+D101+D102+D103+D104+D105+D106+D107+D108+D109+D110+D111+D112+D113+D114+D115+D116+D117+D118+(D119/2)","v":6},0.10452846326765336,16.306919445909429,401.34897786830993,417.65589731421937,417.65589731421937,null,0,null,0,{"$f":"SUM(D98:D119)+$C$97","v":6},48.51975024,0.74918408586881602,48.556493565372641,58.106819539999996,0.84903457815675887,107.8242499979692,null,-202.65,null,156.38074356334184,-107.8242499979692,null,107.8242499979692,-62.923178370980793,-139.72682162901921,-54.034142712155621,-24.333195018399174,54.034142712155621,24.333195018399174]
[null,24,null,0,"from 0 to 20",null,0,127,75.786360920000007,75.786360920000007,37.893180460000004,0.61419127625645442,78.002292084569717,156.00458416913943,{"$f":"+SUM(D98:D119)+(D120/2)+C97","v":6},0.10452846326765336,16.306919445909429,417.65589731421937,433.96281676012882,433.96281676012882,null,0,null,0,{"$f":"SUM(D98:D120)+$C$97","v":6},48.51975024,0.74918408586881602,48.556493565372641,58.106819539999996,0.84903457815675887,107.8242499979692,null,-212.3,null,156.38074356334184,-107.8242499979692,null,107.8242499979692,-65.919520198170346,-146.38047980182967,-51.578045316148554,-23.227140699381025,51.578045316148554,23.227140699381025]
[]
[null,null,null,null,null,null,null,null,null,null,null,null,null,null,null,null,null,null,null,null,null,null,null,null,null,null,null,null,null,null,null,null,null,null,null,null,null,null,null,null,null,null,null,null,null,null,null,null,null,null,null,null,null,null,null,null,null,null,null,null,null,null,null,null,null,null,null,null,null,null,null,null,null,null,null,null,null,null,null,null,null,null,null,"mm"]

{"sheet":"LA 4 SUB","index":2,"n_rows":45,"n_cols":77,"rows_kept":45,"cut":false,"hidden":false,"merged":[[29,37,29,38],[0,52,0,53],[25,1,26,1],[6,23,6,24],[0,11,0,13],[6,11,6,12]]}
[]
[null,null,null,null,null,null,null,null,null,null,null,null,null,null,null,null,null,null,null,null,null,null,null,null,null,null,null,null,null,null,null,null,null,null,null,null,null,null,null,null,null,null,null,null,null,null,null,null,null,null,null,null,"Weight total:",{"$f":"+C11","v":135.5},"kg","Total weight includes: FR 4 ( 9 kg), Main LS Cables (30 kg)"]
[]
[null,null,null,null,null,null,null,null,null,null,null,null,null,null,null,null,null,null,null,null,null,null,null,null,null,null,null,null,null,null,null,null,null,null,null,null,null,null,null,null,null,null,null,null,null,null,null,null,null,null,null,null,"2 motors, kg","front motor",null,null,null,null,null,null,null,null,null,null,null,"rear motor"]
[null,null,null,null,null,null,null,null,null,null,null,null,null,null,null,null,null,null,null,null,null,null,null,null,null,null,null,null,null,null,null,null,null,null,null,null,null,null,null,null,null,null,null,null,null,null,null,null,null,null,null,null,null,{"$f":"+(C8-C9)/C8*C11","v":74.525000000000006},null,null,null,null,null,null,null,null,null,null,null,{"$f":"+(C9/C8)*C11","v":60.975000000000001}]
[null,null,null,null,null,null,null,null,null,null,null,null,null,null,null,null,null,null,null,null,null,null,null,null,null,null,null,null,null,null,null,null,null,null,null,null,null,null,null,null,null,null,null,null,null,null,null,null,null,null,null,null,null,null,null,null,null,null,null,null,null,null,null,{"$f":"IF(BM22=12,11)","v":false},null,{"$f":"IF(BM22=12,13)","v":false}]
[null,null,null,null,null,null,null,null,null,null,null,null,null,null,null,null,null,null,null,null,null,null,null,null,null,null,null,null,null,null,null,null,null,null,null,null,null,null,null,null,null,null,null,null,null,null,null,null,null,null,null,null,null,null,null,null,null,null,null,null,null,{"$f":"IF(BL22=11,9)","v":false},null,null,null,{"$f":"IF(BL22=11,13)","v":false}]
[null,"L(2motors)=",480,null,null,null,null,null,null,null,null,null,null,null,null,null,null,null,null,null,null,null,null,null,null,null,null,null,null,null,null,null,null,null,null,null,null,null,null,null,null,null,null,null,null,null,null,null,null,null,null,null,null,null,null,null,null,null,null,{"$f":"IF(BK22=10,7)","v":false},null,null,null,null,null,{"$f":"IF(BK22=10,13)","v":false}]
[null,"a(2motors)=a-15",{"$f":"+C14-15","v":216},null,null,null,null,null,null,null,null,null,null,null,null,null,null,null,null,null,null,null,null,null,null,null,null,null,null,null,null,null,null,null,null,null,null,null,null,null,null,null,null,null,null,null,null,null,null,null,null,null,null,null,null,null,null,{"$f":"IF(BJ22=9,5)","v":false},null,null,null,null,null,null,null,{"$f":"IF(BJ22=9,13)","v":false}]
[null,null,null,null,null,null,{"$f":"AND(D22>=5,AL22>=5)","v":false},null,null,null,null,null,null,null,null,null,null,null,null,null,null,null,null,null,null,null,null,null,null,null,null,null,null,null,null,null,null,null,null,null,null,null,null,null,null,null,null,null,null,null,null,null,null,null,null,{"$f":"IF(BI22=8,3)","v":false},null,null,null,null,null,null,null,null,null,{"$f":"IF(BI22=8,13)","v":false}]
[null,"G",{"$f":"+B31*32+9.5+30","v":135.5},"kg",null,null,{"$f":"IF(D22>=5,\"O K \",\"OVERLOAD\")","v":"OVERLOAD"},{"$f":"IF(AL22>=5,\"O K \",\"OVERLOAD\")","v":"O K "},null,null,null,null,null,null,null,null,null,null,null,null,null,null,null,null,null,null,null,null,null,null,null,null,null,null,null,null,null,null,null,null,null,null,null,null,null,null,null,null,null,null,null,null,null,{"$f":"IF(BH22=7,1)","v":false},null,null,null,null,null,null,null,null,null,null,null,{"$f":"IF(BH22=7,13)","v":false}]
[null,"L",{"$f":"+AE34","v":152.99803225846358},"mm",null,null,null,null,null,null,null,null,null,null,null,null,null,null,null,null,null,null,null,null,null,null,null,null,null,null,null,null,null,null,null,null,null,null,null,null,null,null,null,null,null,null,null,null,null,null,null,null,null,{"$f":"IF(BH22=61,1)","v":false},null,null,null,null,null,null,null,null,null,null,null,{"$f":"IF(BH22=61,10)","v":false}]
[null,"a при 0 гр.",351,"mm",null,null,1700,1700,null,null,null,null,null,null,null,null,null,null,null,null,null,null,null,null,null,null,null,null,null,null,null,null,null,null,null,null,null,null,null,null,null,null,null,null,null,null,null,null,null,null,null,null,null,{"$f":"IF(BG22=6,1)","v":1},null,null,null,null,null,null,null,null,null,{"$f":"IF(BG22=6,8)","v":8}]
[null,"a",{"$f":"+V34","v":231},"mm",null,null,"Fa=((L-a)/L)*G","Fb=(a/L)*G",null,null,null,null,null,null,null,null,null,null,null,null,null,null,null,null,null,null,null,null,null,null,null,null,null,null,null,null,null,null,null,null,null,null,null,null,null,null,null,null,null,null,null,null,null,{"$f":"IF(BF22=5,1)","v":false},null,null,null,null,null,null,null,{"$f":"IF(BF22=5,9)","v":false}]
[null,null,null,null,null,null,null,null,null,null,null,null,null,null,null,null,null,null,null,null,null,null,null,null,null,null,null,null,null,null,null,null,null,null,null,null,null,null,null,null,null,null,null,null,null,null,null,null,null,null,null,null,null,{"$f":"IF(BE22=4,1)","v":false},null,null,null,null,null,{"$f":"IF(BE22=4,7)","v":false}]
[null,null,null,null,null,null,null,null,null,null,null,null,null,null,null,null,null,null,null,null,null,null,null,null,null,null,null,null,null,null,null,null,null,null,null,null,null,null,null,null,null,null,null,null,null,null,null,null,null,null,null,null,null,{"$f":"IF(BD22=3,1)","v":false},null,null,null,{"$f":"IF(BD22=3,5)","v":false}]
[null,null,null,null,null,null,null,null,null,null,null,null,null,null,null,null,null,null,null,null,null,null,null,null,null,null,null,null,null,null,null,null,null,null,null,null,null,null,null,null,null,null,null,null,null,null,null,null,null,null,null,null,null,{"$f":"IF(BC22=2,1)","v":false},null,{"$f":"IF(BC22=2,3)","v":false}]
[]
[null,null,null,{"$f":"+((C12-C14)/C12)*C11","v":-69.081062501008162},null,null,null,null,null,null,null,null,null,null,null,null,null,null,null,null,null,null,null,null,null,null,null,null,null,null,null,null,null,null,null,null,null,{"$f":"+(C14/C12)*C11","v":204.58106250100815}]
[null,null,"kg",null,null,null,null,null,null,null,null,null,null,null,null,null,null,null,null,null,null,null,null,null,null,null,null,null,null,null,null,null,null,null,null,null,null,null,null,null,null,null,null,null,null,null,null,null,null,null,null,null,"2 points-one motor",{"$f":"SUM(BB6:BB18)","v":1},0,0,0,0,0,{"$f":"SUM(BH6:BH18)","v":0},0,0,0,{"$f":"SUM(BL6:BL18)","v":8},0,0]
[]
[null,null,null,{"$f":"+G13/D19","v":-24.608770312054631},null,null,null,null,null,null,null,null,null,null,null,null,null,null,null,null,null,null,null,null,null,null,null,null,null,null,null,null,null,null,null,null,null,{"$f":"+H13/AL19","v":8.3096645369686772},null,null,null,null,null,null,null,null,null,null,null,null,null,null,null,{"$f":"+BY33","v":false},{"$f":"+BY34","v":false},{"$f":"+BY35","v":false},{"$f":"+BY36","v":false},{"$f":"+BY37","v":false},{"$f":"+BY38","v":6},{"$f":"+BY39","v":false},{"$f":"+BY40","v":false},{"$f":"+BY41","v":false},{"$f":"+BY42","v":false},{"$f":"+BY43","v":false},{"$f":"+BY44","v":false},{"$f":"+BY45","v":false}]
[null,null,null,"front",null,null,null,null,null,null,null,null,null,null,null,null,null,null,null,null,null,null,null,null,null,null,null,null,null,null,null,null,null,null,null,null,null,"rear",null,null,null,null,null,null,null,null,null,null,null,null,null,null,"1 point-one motor",{"$f":"+BB22","v":false},{"$f":"+BC22","v":false},false,false,false,6,false,false,false,false,false,false,false]
[null,"k - safety factor\nof FR 4",null,{"$f":"ABS(D22)","v":24.608770312054631},null,null,null,null,null,null,null,null,null,null,null,null,null,null,null,null,null,null,null,null,null,null,null,null,null,null,null,null,null,null,null,null,null,{"$f":"ABS(AL22)","v":8.3096645369686772},null,null,null,null,null,null,null,null,null,null,null,null,null,null,null,1,2,3,4,5,6,7,8,9,10,11,12,13]
[]
[null,"enter the angle of frame FR 4"]
[null,null,null,{"$f":"IF(AZ28>0,\" \",\"change the angle of frame\")","v":" "},null,null,null,null,null,null,null,null,null,null,null,null,null,null,null,null,null,null,null,null,null,null,null,null,null,null,null,null,null,null,null,null,null,null,null,null,null,null,null,null,null,null,null,null,null,null,null,"center  om mass",null,null,null,null,null,null,null,null,null,null,null,null,null,null,null,null,"center  om mass"]
[null,0,null,{"$f":"IF(BQ28<0,\" \",\"change the angle of frame\")","v":" "},null,null,null,null,null,null,null,null,null,null,null,null,null,null,null,null,null,null,null,null,null,null,null,null,null,null,null,null,null,null,null,null,null,null,null,null,null,null,null,null,null,null,null,null,null,null,null,{"$f":"-+BV33","v":216},null,null,null,null,null,null,null,null,null,null,null,null,null,null,null,null,{"$f":"+-BV45","v":-264}]
[]
[null,"enter the number of cabinets from 1 up to 12",null,null,null,null,null,null,null,null,null,null,null,null,null,null,null,null,null,null,null,null,null,null,null,null,null,null,null,null,null,null,null,null,null,null,null,"k - safety factor"]
[null,3,null,"LA 4 SUB",null,null,null,null,null,null,null,null,null,null,null,null,null,null,null,null,null,null,null,null,null,null,null,null,null,null,null,null,null,null,null,null,null,"front","rear"]
[null,null,null,null,null,"d","k","b","b/2","sin b/2","c=sin(b/2)*d","2c","e=a/2","sin(e)","f=sin(e)*2c","g center of  mass -x","h=g+f","center of mass X"]
[null,null,null,null,null,null,null,null,null,null,null,null,null,null,null,null,null,null,null,null,null,"z- център на тежест на боксовете след него спрямо първата колона","a - общ ъгъл","t= 58.15-a","sin t","m= sin t *n(const)","a","sin r","p= sin r *q(const)","g SC8 - тегло на боксожете под тази ","L=m-p","J=x-p","Asc8=z-J","Fa=((L-A)/L)*G","Fb=(A/L)*G","front","rear",null,null,null,null,null,null,null,null,null,null,null,null,null,null,null,null,null,null,null,null,null,null,null,null,null,null,null,null,null,null,null,null,null,1,15,null,{"$f":"+BT33-C$14","v":-216},{"$f":"ABS(BV33)","v":216},{"$f":"MIN(BW32:BW45)","v":16},{"$f":"IF(BX33=BW33,BS33)","v":false}]
[null,1,{"$f":"+(B28*-1)+D34","v":0},0,null,323.5,88.872906259999993,{"$f":"+G34-C34","v":88.872906259999993},{"$f":"+H34/2","v":44.436453129999997},{"$f":"SIN(I34*3.14159265358979/180)","v":0.70011776578649665},{"$f":"+J34*F34","v":226.48809723193168},{"$f":"+K34*2","v":452.97619446386335},{"$f":"+C34/2","v":0},{"$f":"SIN(M34*3.14159265358979/180)","v":0},{"$f":"+N34*L34","v":0},231,{"$f":"+P34+O34","v":231},{"$f":"+Q34","v":231},null,{"$f":"IF(B34<($B$31+1),R34,0)","v":231},null,{"$f":"SUM(T34:T45)/($B$31)","v":231},{"$f":"+D34+C34","v":0},{"$f":"157.42570277-$W$34","v":157.42570276999999},{"$f":"SIN(X34*3.14159265358979/180)","v":0.38388113378270589},{"$f":"+Y34*203.18","v":77.99696876197018},{"$f":"45.56354687+$W$34","v":45.563546870000003},{"$f":"SIN(AA34*3.14159265358979/180)","v":0.71402739025202855},{"$f":"+AB34*323.51","v":230.99500102043376},{"$f":"32*B31","v":96},{"$f":"+AC34-Z34","v":152.99803225846358},{"$f":"+T34-AC34","v":4.998979566238404E-3},{"$f":"+V34-AF34","v":230.99500102043376},{"$f":"+((AE34-AG34)/AE34)*AD34","v":-48.939903936149683},{"$f":"+(AG34/AE34)*AD34","v":144.93990393614968},{"$f":"2*$G$13/AH34","v":-69.472960233756694},{"$f":"2*$H$13/AI34","v":23.457998161070954},{"$f":"ABS(AJ34)","v":69.472960233756694},{"$f":"ABS(AK34)","v":23.457998161070954},null,null,null,null,null,null,null,null,null,null,null,null,null,null,null,null,null,null,null,null,null,null,null,null,null,null,null,null,null,null,null,2,55,null,-176,176,{"$f":"MIN(BW32:BW45)","v":16},false]
[null,2,null,0,null,323.5,88.872906259999993,{"$f":"+G35-D35","v":88.872906259999993},44.436453129999997,0.70011776578649665,226.48809723193168,452.97619446386335,{"$f":"+C34+(D35/2)","v":0},0,0,{"$f":"+R34","v":231},{"$f":"+P35+O35","v":231},231,null,231,null,{"$f":"SUM(T35:T45)/($B$31-B34)","v":231},null,{"$f":"157.42570277-$W$34","v":157.42570276999999},{"$f":"SIN(X35*3.14159265358979/180)","v":0.38388113378270589},{"$f":"+Y35*203.18","v":77.99696876197018},{"$f":"45.56354687+$W$34","v":45.563546870000003},{"$f":"SIN(AA35*3.14159265358979/180)","v":0.71402739025202855},{"$f":"+AB35*323.51","v":230.99500102043376},{"$f":"32*($B$31-B34)","v":64},{"$f":"+AC35-Z35","v":152.99803225846358},{"$f":"+T35-AC35","v":4.998979566238404E-3},230.99500102043376,{"$f":"+((AE35-AG35)/AE35)*AD35","v":-32.626602624099789},{"$f":"+(AG35/AE35)*AD35","v":96.626602624099789},-104.20944035063505,35.186997241606434,{"$f":"ABS(AJ35)","v":104.20944035063505},35.186997241606434,null,null,null,null,null,null,null,null,null,null,null,null,null,null,null,null,null,null,null,null,null,null,null,null,null,null,null,null,null,null,null,3,{"$f":"+BT34+40","v":95},null,-136,136,{"$f":"MIN(BW32:BW46)","v":16},false]
[null,3,null,0,null,323.5,88.872906259999993,88.872906259999993,44.436453129999997,0.70011776578649665,226.48809723193168,452.97619446386335,{"$f":"+C34+D35+(D36/2)","v":0},0,0,231,{"$f":"+Q35+O36","v":231},231,null,231,null,{"$f":"SUM(T36:T45)/($B$31-B35)","v":231},null,157.42570276999999,{"$f":"SIN(X36*3.14159265358979/180)","v":0.38388113378270589},77.99696876197018,45.563546870000003,0.71402739025202855,230.99500102043376,{"$f":"32*($B$31-B35)","v":32},152.99803225846358,{"$f":"+T36-AC36","v":4.998979566238404E-3},230.99500102043376,-16.313301312049894,48.313301312049894,-208.4188807012701,70.373994483212869,208.4188807012701,70.373994483212869,null,null,null,null,null,null,null,null,null,null,null,null,null,null,null,null,null,null,null,null,null,null,null,null,null,null,null,null,null,null,null,4,135,null,-96,96,{"$f":"MIN(BW33:BW46)","v":16},false]
[null,4,null,0,null,323.5,88.872906259999993,88.872906259999993,44.436453129999997,0.70011776578649665,226.48809723193168,452.97619446386335,{"$f":"+C34+D35+D36+(D37/2)","v":0},0,0,231,231,231,null,0,null,{"$f":"SUM(T37:T45)/($B$31-B36)","v":{"$error":"#DIV/0!"}},null,157.42570276999999,0.38388113378270589,77.99696876197018,45.563546870000003,0.71402739025202855,230.99500102043376,0,152.99803225846358,{"$f":"+T37-AC37","v":-230.99500102043376},{"$error":"#DIV/0!"},{"$error":"#DIV/0!"},{"$error":"#DIV/0!"},{"$error":"#DIV/0!"},{"$error":"#DIV/0!"},{"$error":"#DIV/0!"},{"$error":"#DIV/0!"},null,null,null,null,null,null,null,null,null,null,null,null,null,null,null,null,null,null,null,null,null,null,null,null,null,null,null,null,null,null,null,5,175,null,-56,56,{"$f":"MIN(BW33:BW46)","v":16},false]
[null,5,null,0,null,323.5,88.872906259999993,88.872906259999993,44.436453129999997,0.70011776578649665,226.48809723193168,452.97619446386335,{"$f":"+C34+D35+D36+D37+(D38/2)","v":0},0,0,231,231,231,null,0,null,{"$f":"SUM(T38:T45)/($B$31-B37)","v":0},null,157.42570276999999,0.38388113378270589,77.99696876197018,45.563546870000003,0.71402739025202855,230.99500102043376,-32,152.99803225846358,{"$f":"+T38-AC38","v":-230.99500102043376},230.99500102043376,16.313301312049894,-48.313301312049894,208.4188807012701,-70.373994483212869,208.4188807012701,70.373994483212869,null,null,null,null,null,null,null,null,null,null,null,null,null,null,null,null,null,null,null,null,null,null,null,null,null,null,null,null,null,null,null,6,215,null,-16,16,{"$f":"MIN(BW33:BW46)","v":16},6]
[null,6,null,0,null,323.5,88.872906259999993,88.872906259999993,44.436453129999997,0.70011776578649665,226.48809723193168,452.97619446386335,{"$f":"+C34+D35+D36+D37+D38+(D39/2)","v":0},0,0,231,231,231,null,0,null,{"$f":"SUM(T39:T45)/($B$31-B38)","v":0},null,157.42570276999999,0.38388113378270589,77.99696876197018,45.563546870000003,0.71402739025202855,230.99500102043376,-64,152.99803225846358,-230.99500102043376,230.99500102043376,32.626602624099789,-96.626602624099789,104.20944035063505,-35.186997241606434,104.20944035063505,35.186997241606434,null,null,null,null,null,null,null,null,null,null,null,null,null,null,null,null,null,null,null,null,null,null,null,null,null,null,null,null,null,null,null,7,255,null,24,24,{"$f":"MIN(BW33:BW46)","v":16},false]
[null,7,null,0,null,323.5,88.872906259999993,88.872906259999993,44.436453129999997,0.70011776578649665,226.48809723193168,452.97619446386335,{"$f":"+C34+D35+D36+D37+D38+D39+(D40/2)","v":0},0,0,231,231,231,null,0,null,{"$f":"SUM(T40:T45)/($B$31-B39)","v":0},null,157.42570276999999,0.38388113378270589,77.99696876197018,45.563546870000003,0.71402739025202855,230.99500102043376,-96,152.99803225846358,-230.99500102043376,230.99500102043376,48.939903936149683,-144.93990393614968,69.472960233756694,-23.457998161070954,69.472960233756694,23.457998161070954,null,null,null,null,null,null,null,null,null,null,null,null,null,null,null,null,null,null,null,null,null,null,null,null,null,null,null,null,null,null,null,8,295,null,64,64,{"$f":"MIN(BW33:BW46)","v":16},false]
[null,8,null,0,null,323.5,88.872906259999993,88.872906259999993,44.436453129999997,0.70011776578649665,226.48809723193168,452.97619446386335,{"$f":"+C34+D35+D36+D37+D38+D39+D40+(D41/2)","v":0},0,0,231,231,231,null,0,null,{"$f":"SUM(T41:T45)/($B$31-B40)","v":0},null,157.42570276999999,0.38388113378270589,77.99696876197018,45.563546870000003,0.71402739025202855,230.99500102043376,-128,152.99803225846358,-230.99500102043376,230.99500102043376,65.253205248199578,-193.25320524819958,52.104720175317524,-17.593498620803217,52.104720175317524,17.593498620803217,null,null,null,null,null,null,null,null,null,null,null,null,null,null,null,null,null,null,null,null,null,null,null,null,null,null,null,null,null,null,null,9,335,null,104,104,{"$f":"MIN(BW32:BW45)","v":16},false]
[null,9,null,0,null,323.5,88.872906259999993,88.872906259999993,44.436453129999997,0.70011776578649665,226.48809723193168,452.97619446386335,{"$f":"+C34+D35+D36+D37+D38+D39+D40+D41+(D42/2)","v":0},0,0,231,231,231,null,0,null,{"$f":"SUM(T42:T45)/($B$31-B41)","v":0},null,157.42570276999999,0.38388113378270589,77.99696876197018,45.563546870000003,0.71402739025202855,230.99500102043376,-160,152.99803225846358,-230.99500102043376,230.99500102043376,81.566506560249479,-241.56650656024948,41.683776140254018,-14.074798896642571,41.683776140254018,14.074798896642571,null,null,null,null,null,null,null,null,null,null,null,null,null,null,null,null,null,null,null,null,null,null,null,null,null,null,null,null,null,null,null,10,375,null,144,144,{"$f":"MIN(BW32:BW45)","v":16},false]
[null,10,null,0,null,323.5,88.872906259999993,88.872906259999993,44.436453129999997,0.70011776578649665,226.48809723193168,452.97619446386335,{"$f":"+C34+D35+D36+D37+D38+D39+D40+D41+D42+(D43/2)","v":0},0,0,231,231,231,null,0,null,{"$f":"SUM(T43:T45)/($B$31-B42)","v":0},null,157.42570276999999,0.38388113378270589,77.99696876197018,45.563546870000003,0.71402739025202855,230.99500102043376,-192,152.99803225846358,-230.99500102043376,230.99500102043376,97.879807872299367,-289.87980787229935,34.736480116878347,-11.728999080535477,34.736480116878347,11.728999080535477,null,null,null,null,null,null,null,null,null,null,null,null,null,null,null,null,null,null,null,null,null,null,null,null,null,null,null,null,null,null,null,11,415,null,184,184,{"$f":"MIN(BW33:BW46)","v":16},false]
[null,11,null,0,null,323.5,88.872906259999993,88.872906259999993,44.436453129999997,0.70011776578649665,226.48809723193168,452.97619446386335,{"$f":"+C34+D35+D36+D37+D38+D39+D40+D41+D42+D43+(D44/2)","v":0},0,0,231,231,231,null,0,null,{"$f":"SUM(T44:T45)/($B$31-B43)","v":0},null,157.42570276999999,0.38388113378270589,77.99696876197018,45.563546870000003,0.71402739025202855,230.99500102043376,-224,152.99803225846358,-230.99500102043376,230.99500102043376,114.19310918434925,-338.19310918434928,29.774125814467158,-10.053427783316122,29.774125814467158,10.053427783316122,null,null,null,null,null,null,null,null,null,null,null,null,null,null,null,null,null,null,null,null,null,null,null,null,null,null,null,null,null,null,null,12,455,null,224,224,{"$f":"MIN(BW33:BW46)","v":16},false]
[null,12,null,0,null,323.5,88.872906259999993,88.872906259999993,44.436453129999997,0.70011776578649665,226.48809723193168,452.97619446386335,{"$f":"+C34+D35+D36+D37+D38+D39+D40+D41+D42+D43+D44+(D45/2)","v":0},0,0,231,231,231,null,0,null,{"$f":"SUM(T45)/($B$31-B44)","v":0},null,157.42570276999999,0.38388113378270589,77.99696876197018,45.563546870000003,0.71402739025202855,230.99500102043376,-256,152.99803225846358,-230.99500102043376,230.99500102043376,130.50641049639916,-386.50641049639916,26.052360087658762,-8.7967493104016086,26.052360087658762,8.7967493104016086,null,null,null,null,null,null,null,null,null,null,null,null,null,null,null,null,null,null,null,null,null,null,null,null,null,null,null,null,null,null,null,13,495,null,264,264,{"$f":"MIN(BW33:BW46)","v":16},false]